program: Orca
programVersion: 5.0.2
elementType: F O N N N N N C C C C C C C C C C C C C C C C C H H H H H H H H H H H H H H H H H H H H H H H H
charge: 0
multiplicity: 1
keywords: wb97x-d3
keywords: def2-TZVPP
keywords: def2/J RIJCOSX
keywords: DEFGRID2
keywords: scfconv7
keywords: smallprint printgap noloewdin
keywords: NOSOSCF
formula: C17H24FN5O
InChI: InChI=1/C17H24FN5O/c1-10-6-11(2)8-13(7-10)24-9-12(3)20-16-22-14(17(4,5)18)21-15(19)23-16/h6-8,12,20H,9,19H2,1-5H3
48 atoms
F  3.983059 -2.036329 1.149464
O  -2.838128 1.519657 -1.05016
N  -1.536652 -1.900477 -0.65615
N  0.561724 -1.666486 0.270606
N  2.130943 -3.392235 -0.043591
N  -0.038981 -3.580936 -0.981645
N  1.519819 -5.225642 -1.259478
C  -2.049596 -0.633688 -0.181946
C  -2.347291 0.242281 -1.40344
C  2.723805 -1.453542 1.297456
C  -3.284228 -0.841021 0.68248
C  1.747771 -2.229166 0.432486
C  -0.306439 -2.389014 -0.447753
C  -1.982919 2.491809 -0.653472
C  2.830688 -0.0037 0.864484
C  2.321029 -1.587473 2.756906
C  -0.597303 2.376847 -0.654346
C  -2.582759 3.683935 -0.246394
C  0.190757 3.460327 -0.262428
C  -1.808499 4.764037 0.148761
C  -0.418811 4.642778 0.134093
C  1.187738 -4.036281 -0.755516
C  1.686717 3.336563 -0.251753
C  -2.449336 6.050144 0.580771
H  -1.265199 -0.171683 0.416614
H  -1.467014 0.3130 -2.049491
H  -3.141149 -0.220035 -1.995409
H  -2.162208 -2.493462 -1.182265
H  -3.671148 0.107062 1.055271
H  -3.048861 -1.462395 1.546669
H  -4.083208 -1.330198 0.120211
H  3.570253 0.516799 1.47419
H  1.876671 0.503336 0.988168
H  3.127121 0.081403 -0.181997
H  3.030064 -1.060715 3.397334
H  2.291659 -2.634003 3.064629
H  1.3339 -1.158627 2.923849
H  -3.664438 3.758846 -0.25004
H  0.194037 5.485473 0.436387
H  2.057293 3.117259 0.752078
H  2.030951 2.538277 -0.908659
H  2.165398 4.262541 -0.571675
H  -2.155635 6.877117 -0.068214
H  -2.149026 6.321343 1.594444
H  2.449819 -5.585905 -1.133526
H  0.867702 -5.740313 -1.82569
H  -0.103942 1.462346 -0.95866
H  -3.536777 5.986015 0.563489
elementType: F O N C H
totalener: -1111.29567527 hartree
nucrepener: 2105.43348018 hartree
electener: -3216.72915545 hartree
oneelecener: -5697.56491102 hartree
twoeener: 2480.83575557 hartree
cpcmener: -0.03283255 hartree
kineticenergy: 1106.43085175 hartree
xcener: -106.877482393569 hartree
chargesum: -0.0000000
charge: -0.262865 -0.337718 -0.196918 -0.466354 -0.393834 -0.440849 -0.249266 0.071212 0.012612 0.343100 -0.275312 0.216387 0.392092 0.325851 -0.312477 -0.312687 -0.235665 -0.301086 0.029186 0.045471 -0.269184 0.352214 -0.261569 -0.213060 0.094435 0.108995 0.126398 0.157904 0.090662 0.098034 0.091118 0.110239 0.083887 0.114082 0.104312 0.109331 0.097921 0.120026 0.122099 0.106999 0.098304 0.108008 0.102344 0.101408 0.191897 0.189759 0.121276 0.091279
qa: -0.2629 -0.3377 -0.1969 -0.4664 -0.3938 -0.4408 -0.2493 0.0712 0.0126 0.3431 -0.2753 0.2164 0.3921 0.3259 -0.3125 -0.3127 -0.2357 -0.3011 0.0292 0.0455 -0.2692 0.3522 -0.2616 -0.2131 0.0944 0.1090 0.1264 0.1579 0.0907 0.0980 0.0911 0.1102 0.0839 0.1141 0.1043 0.1093 0.0979 0.1200 0.1221 0.1070 0.0983 0.1080 0.1023 0.1014 0.1919 0.1898 0.1213 0.0913
va: 1.0087 2.0687 3.1894 2.9537 3.0177 2.9735 3.2027 3.7799 3.8781 3.9295 3.9537 4.0519 4.2372 3.8049 3.9469 3.9267 3.8300 4.0438 3.6838 3.7481 3.9642 4.3369 3.9155 3.8960 1.0352 1.0052 0.9942 1.0324 1.0137 1.0075 1.0035 1.0070 1.0075 1.0043 1.0049 1.0098 1.0118 1.0236 1.0100 0.9882 0.9982 1.0025 0.9950 0.9956 1.0100 1.0109 1.0198 1.0060
dispcorr: -0.022892547 hartree
energy: -1111.318567817617
dipole: -8.83312 7.83224 -1.00088 20.14907 -20.55264 -0.40357 5.70538 -6.07481 -0.36944
magnitude: 1.14066 au
magnitude: 2.89934 debye
