program: Orca
programVersion: 5.0.2
elementType: F O N N N N N C C C C C C C C C C C C C C C C C H H H H H H H H H H H H H H H H H H H H H H H H
charge: 0
multiplicity: 1
keywords: wb97x-d3
keywords: def2-TZVPP
keywords: def2/J RIJCOSX
keywords: DEFGRID2
keywords: scfconv7
keywords: smallprint printgap noloewdin
keywords: NOSOSCF
formula: C17H24FN5O
InChI: InChI=1/C17H24FN5O/c1-10-6-11(2)8-13(7-10)24-9-12(3)20-16-22-14(17(4,5)18)21-15(19)23-16/h6-8,12,20H,9,19H2,1-5H3
48 atoms
F  3.878232 -2.814894 1.086232
O  -2.307526 1.423993 1.530277
N  -1.488677 -0.981081 -0.18664
N  0.507189 -1.767132 0.64076
N  2.365446 -1.887366 -0.798817
N  0.290926 -1.065145 -1.608435
N  2.139295 -1.145874 -2.945333
C  -2.132279 -0.987167 1.109705
C  -1.747067 0.211569 1.97907
C  2.569231 -2.651501 1.503233
C  -3.637654 -1.096395 0.917996
C  1.770127 -2.056446 0.358335
C  -0.194826 -1.280754 -0.387334
C  -1.757974 2.111623 0.499808
C  2.570701 -1.710691 2.69729
C  2.012153 -4.022457 1.855046
C  -2.618913 2.992835 -0.154239
C  -0.434045 2.017054 0.09696
C  -2.167938 3.773191 -1.204937
C  0.02848 2.785292 -0.970495
C  -0.838999 3.656761 -1.610149
C  1.570506 -1.375013 -1.751558
C  -3.090177 4.733306 -1.898792
C  1.451157 2.636034 -1.425237
H  -1.777594 -1.871552 1.644487
H  -2.155611 0.057885 2.980233
H  -0.660079 0.262698 2.086266
H  -1.938502 -0.496846 -0.947058
H  -3.891481 -2.017217 0.394147
H  -4.036395 -0.257209 0.34668
H  -4.148263 -1.104431 1.880453
H  3.004907 -0.745683 2.434038
H  3.157825 -2.136772 3.511236
H  1.556435 -1.543504 3.053363
H  0.973976 -3.942601 2.171167
H  2.589261 -4.467964 2.665844
H  2.057065 -4.692503 0.996052
H  0.259663 1.348349 0.590652
H  -0.478827 4.25516 -2.439554
H  -3.085742 4.580142 -2.978682
H  -4.117454 4.626973 -1.552946
H  -2.7891 5.766791 -1.719703
H  2.146368 2.677917 -0.58622
H  1.732686 3.419432 -2.127549
H  3.082057 -1.449295 -3.102265
H  1.571278 -0.853184 -3.717935
H  -3.648186 3.059093 0.177607
H  1.602108 1.675523 -1.920754
totalener: -1111.25941708 hartree
nucrepener: 2183.63689089 hartree
electener: -3294.89630797 hartree
oneelecener: -5853.28929745 hartree
twoeener: 2558.39298948 hartree
kineticenergy: 1106.50254469 hartree
xcener: -106.887872263853 hartree
chargesum: -0.0000000
charge: -0.225162 -0.300932 -0.193125 -0.434331 -0.318080 -0.369019 -0.260584 0.124273 -0.025732 0.362335 -0.267468 0.166394 0.316502 0.212303 -0.306779 -0.307687 -0.222726 -0.178728 0.060620 0.060280 -0.206449 0.350093 -0.216776 -0.232189 0.067123 0.107941 0.100560 0.150841 0.104584 0.085013 0.079180 0.100570 0.095398 0.086811 0.091962 0.091127 0.102565 0.085991 0.089060 0.092891 0.079865 0.099486 0.096138 0.081451 0.168740 0.165003 0.099408 0.091261
qa: -0.2252 -0.3009 -0.1931 -0.4343 -0.3181 -0.3690 -0.2606 0.1243 -0.0257 0.3623 -0.2675 0.1664 0.3165 0.2123 -0.3068 -0.3077 -0.2227 -0.1787 0.0606 0.0603 -0.2064 0.3501 -0.2168 -0.2322 0.0671 0.1079 0.1006 0.1508 0.1046 0.0850 0.0792 0.1006 0.0954 0.0868 0.0920 0.0911 0.1026 0.0860 0.0891 0.0929 0.0799 0.0995 0.0961 0.0815 0.1687 0.1650 0.0994 0.0913
va: 1.0641 2.0819 3.1996 2.9354 3.0446 2.9904 3.1789 3.8388 3.8815 3.9040 3.9534 4.0782 4.2723 3.9145 3.9458 3.9433 4.0263 3.8651 3.7717 3.7747 3.9861 4.2657 3.9050 3.9096 1.0303 1.0024 1.0044 1.0375 1.0070 1.0095 1.0084 1.0098 1.0104 1.0131 1.0129 1.0079 1.0113 1.0221 1.0170 0.9979 1.0086 0.9945 1.0000 1.0090 1.0286 1.0280 1.0257 1.0056
dispcorr: -0.025431360 hartree
energy: -1111.284848439678
dipole: -12.12687 11.40419 -0.72268 8.58560 -8.63111 -0.04551 2.60628 -3.03416 -0.42788
magnitude: 0.84108 au
magnitude: 2.13785 debye
