program: Orca
programVersion: 5.0.2
elementType: F O N N N N N C C C C C C C C C C C C C C C C C H H H H H H H H H H H H H H H H H H H H H H H H
charge: 0
multiplicity: 1
keywords: wb97x-d3
keywords: def2-TZVPP
keywords: def2/J RIJCOSX
keywords: DEFGRID2
keywords: scfconv7
keywords: smallprint printgap noloewdin
keywords: NOSOSCF
formula: C17H24FN5O
InChI: InChI=1/C17H24FN5O/c1-10-6-11(2)8-13(7-10)24-9-12(3)20-16-22-14(17(4,5)18)21-15(19)23-16/h6-8,12,20H,9,19H2,1-5H3
48 atoms
F  2.456302 -0.629512 1.281975
O  -2.737967 1.511674 -0.351975
N  -1.789186 -2.049252 -0.317867
N  0.464851 -1.63399 -0.129517
N  1.97364 -3.202958 -1.022875
N  -0.357847 -3.569401 -1.221914
N  1.149471 -5.021096 -2.133705
C  -2.18636 -0.795786 0.286742
C  -2.30968 0.258643 -0.820049
C  2.842667 -1.242207 0.0942
C  -3.486411 -0.980509 1.051491
C  1.677046 -2.096782 -0.370984
C  -0.52361 -2.423085 -0.564467
C  -1.840713 2.396298 0.145432
C  4.087249 -2.05832 0.383304
C  3.096255 -0.158346 -0.94286
C  -2.358499 3.655507 0.450326
C  -0.494166 2.128941 0.351777
C  -1.53992 4.64974 0.95385
C  0.341427 3.131026 0.84989
C  -0.1860 4.376712 1.146413
C  0.906095 -3.900266 -1.437947
C  -2.091624 6.004143 1.293048
C  1.805257 2.856701 1.035915
H  -1.399502 -0.505686 0.984164
H  -1.363817 0.333592 -1.368194
H  -3.072549 -0.067441 -1.532793
H  -2.500752 -2.655266 -0.692384
H  -3.367425 -1.723745 1.839171
H  -4.296888 -1.305419 0.393632
H  -3.796399 -0.045705 1.51389
H  4.441078 -2.557592 -0.514966
H  3.893018 -2.822175 1.135406
H  4.877903 -1.404352 0.751921
H  2.200965 0.440931 -1.108495
H  3.389124 -0.604755 -1.892917
H  3.898435 0.504323 -0.616134
H  -0.070527 1.149823 0.157809
H  0.464219 5.151279 1.537964
H  -1.978892 6.220551 2.356646
H  -1.569774 6.792078 0.748014
H  -3.150845 6.081395 1.05172
H  2.250919 3.539144 1.758924
H  2.345734 2.98279 0.094967
H  2.09365 -5.342344 -2.233251
H  0.388108 -5.62029 -2.390656
H  -3.412786 3.841525 0.285057
H  1.985427 1.838752 1.375536
totalener: -1111.26310365 hartree
nucrepener: 2134.53119537 hartree
electener: -3245.79429902 hartree
oneelecener: -5755.36782128 hartree
twoeener: 2509.57352227 hartree
kineticenergy: 1106.50024601 hartree
xcener: -106.885766325315 hartree
chargesum: -0.0000000
charge: -0.240484 -0.302323 -0.202667 -0.389924 -0.393630 -0.397019 -0.261120 0.049480 0.014080 0.344249 -0.268587 0.179605 0.390401 0.290187 -0.250617 -0.353409 -0.249330 -0.152487 0.057545 0.009346 -0.199860 0.355995 -0.219125 -0.275249 0.105840 0.101717 0.102327 0.139082 0.102446 0.070610 0.098759 0.084146 0.099066 0.091272 0.107284 0.116375 0.100589 0.072273 0.088074 0.096665 0.094749 0.078746 0.086121 0.093066 0.164318 0.162674 0.095989 0.112753
qa: -0.2405 -0.3023 -0.2027 -0.3899 -0.3936 -0.3970 -0.2611 0.0495 0.0141 0.3442 -0.2686 0.1796 0.3904 0.2902 -0.2506 -0.3534 -0.2493 -0.1525 0.0575 0.0093 -0.1999 0.3560 -0.2191 -0.2752 0.1058 0.1017 0.1023 0.1391 0.1024 0.0706 0.0988 0.0841 0.0991 0.0913 0.1073 0.1164 0.1006 0.0723 0.0881 0.0967 0.0947 0.0787 0.0861 0.0931 0.1643 0.1627 0.0960 0.1128
va: 1.0369 2.0954 3.1578 3.0277 2.9999 3.0078 3.1884 3.8007 3.8526 3.8328 3.9443 4.1298 4.2005 3.8732 3.9355 3.9498 4.0653 3.8377 3.7945 3.7926 3.9840 4.3119 3.9064 3.9082 1.0132 1.0120 1.0013 1.0473 1.0065 1.0053 1.0148 1.0221 1.0149 1.0082 0.9980 1.0127 1.0046 1.0427 1.0167 0.9951 0.9964 1.0092 1.0096 0.9884 1.0298 1.0304 1.0274 1.0115
dispcorr: -0.023644204 hartree
energy: -1111.286747851669
dipole: -0.07914 0.13120 0.05206 13.88973 -15.06676 -1.17703 2.07993 -2.86025 -0.78032
magnitude: 1.41315 au
magnitude: 3.59195 debye
