program: Orca
programVersion: 5.0.2
elementType: F O N N N N N C C C C C C C C C C C C C C C C C H H H H H H H H H H H H H H H H H H H H H H H H
charge: 0
multiplicity: 1
keywords: wb97x-d3
keywords: def2-TZVPP
keywords: def2/J RIJCOSX
keywords: DEFGRID2
keywords: scfconv7
keywords: smallprint printgap noloewdin
keywords: NOSOSCF
formula: C17H24FN5O
InChI: InChI=1/C17H24FN5O/c1-10-6-11(2)8-13(7-10)24-9-12(3)20-16-22-14(17(4,5)18)21-15(19)23-16/h6-8,12,20H,9,19H2,1-5H3
48 atoms
F  1.035511 -2.168817 -2.021439
O  -2.88137 0.640856 -0.739632
N  -1.715682 -0.538634 1.63073
N  0.021066 -1.492191 0.451825
N  2.1766 -0.590975 0.702558
N  0.37736 0.281503 1.973673
N  2.496323 1.097662 2.211114
C  -2.787437 -1.17314 0.883092
C  -2.808122 -0.761785 -0.591514
C  1.805591 -2.411682 -0.875005
C  -2.804547 -2.690783 1.023218
C  1.309529 -1.424852 0.171334
C  -0.403637 -0.591005 1.340408
C  -1.729817 1.364654 -0.727466
C  3.259771 -2.211144 -1.244594
C  1.525422 -3.834438 -0.425523
C  -1.725443 2.536112 0.014123
C  -0.596569 0.994507 -1.446992
C  -0.588881 3.336018 0.063848
C  0.546392 1.780328 -1.402842
C  0.541555 2.944763 -0.638989
C  1.648751 0.243203 1.61467
C  -0.589131 4.585818 0.895509
C  1.766298 1.390377 -2.186087
H  -3.702379 -0.785176 1.338045
H  -1.952162 -1.197069 -1.111417
H  -3.711483 -1.167666 -1.051582
H  -1.962503 0.236546 2.222094
H  -3.699042 -3.103584 0.554462
H  -2.817031 -2.97688 2.074204
H  -1.931948 -3.142072 0.556355
H  3.538033 -2.909295 -2.034433
H  3.903911 -2.392147 -0.386314
H  3.451338 -1.197347 -1.591181
H  2.088142 -4.064875 0.479591
H  1.824797 -4.543986 -1.197471
H  0.467495 -3.973673 -0.210985
H  -0.586902 0.089721 -2.040327
H  1.433691 3.5605 -0.601105
H  -1.446902 5.218933 0.665885
H  -0.638883 4.350304 1.960385
H  0.310745 5.177315 0.731136
H  1.667714 0.390842 -2.605093
H  2.657948 1.397325 -1.558265
H  3.431144 1.176728 1.857674
H  2.120591 1.837695 2.773946
H  -2.618018 2.816796 0.561762
H  1.941152 2.081961 -3.012166
totalener: -1111.25586880 hartree
nucrepener: 2316.11347552 hartree
electener: -3427.36934432 hartree
oneelecener: -6118.89009035 hartree
twoeener: 2691.52074602 hartree
kineticenergy: 1106.52266173 hartree
xcener: -106.894104581848 hartree
chargesum: -0.0000000
charge: -0.251273 -0.320017 -0.192603 -0.394763 -0.342454 -0.354558 -0.253205 0.125717 -0.015678 0.330776 -0.295817 0.157754 0.348193 0.239003 -0.268783 -0.290230 -0.221143 -0.139843 0.067735 0.015605 -0.205679 0.340397 -0.233508 -0.257241 0.062803 0.102176 0.096748 0.140350 0.084981 0.088075 0.103780 0.093015 0.086980 0.096891 0.086415 0.091386 0.110431 0.106437 0.083013 0.097417 0.094767 0.078651 0.084166 0.089617 0.159790 0.161826 0.097677 0.114225
qa: -0.2513 -0.3200 -0.1926 -0.3948 -0.3425 -0.3546 -0.2532 0.1257 -0.0157 0.3308 -0.2958 0.1578 0.3482 0.2390 -0.2688 -0.2902 -0.2211 -0.1398 0.0677 0.0156 -0.2057 0.3404 -0.2335 -0.2572 0.0628 0.1022 0.0967 0.1404 0.0850 0.0881 0.1038 0.0930 0.0870 0.0969 0.0864 0.0914 0.1104 0.1064 0.0830 0.0974 0.0948 0.0787 0.0842 0.0896 0.1598 0.1618 0.0977 0.1142
va: 1.0219 2.0727 3.1919 2.9603 2.9855 3.0157 3.2023 3.8391 3.8823 3.8304 3.9186 4.1233 4.2707 3.8796 3.9712 3.9571 4.0364 3.7883 3.7611 3.6587 3.9185 4.2996 3.9055 3.9019 1.0079 1.0093 1.0065 1.0433 1.0089 1.0132 1.0091 1.0085 1.0141 1.0107 1.0081 1.0092 1.0091 1.0230 1.0172 0.9996 0.9940 1.0077 1.0223 0.9989 1.0327 1.0310 1.0233 0.9991
dispcorr: -0.030659082 hartree
energy: -1111.286527885904
dipole: 2.24174 -1.81964 0.42210 -0.74990 0.85119 0.10129 0.16060 0.77572 0.93631
magnitude: 1.03204 au
magnitude: 2.62324 debye
