program: Orca
programVersion: 5.0.2
elementType: F O N N N N N C C C C C C C C C C C C C C C C C H H H H H H H H H H H H H H H H H H H H H H H H
charge: 0
multiplicity: 1
keywords: wb97x-d3
keywords: def2-TZVPP
keywords: def2/J RIJCOSX
keywords: DEFGRID2
keywords: scfconv7
keywords: smallprint printgap noloewdin
keywords: NOSOSCF
formula: C17H24FN5O
InChI: InChI=1/C17H24FN5O/c1-10-6-11(2)8-13(7-10)24-9-12(3)20-16-22-14(17(4,5)18)21-15(19)23-16/h6-8,12,20H,9,19H2,1-5H3
48 atoms
F  3.893008 -2.930966 1.438928
O  -1.803906 1.478595 0.433512
N  -1.451088 -1.982464 -0.633351
N  0.594988 -2.094215 0.402456
N  2.176846 -3.656601 -0.366094
N  0.055486 -3.500966 -1.421635
N  1.639337 -4.977621 -2.145557
C  -1.913462 -0.881398 0.182052
C  -1.423027 0.431441 -0.42352
C  2.70822 -2.222747 1.531808
C  -3.427882 -0.935323 0.302457
C  1.772038 -2.702614 0.43895
C  -0.22937 -2.538959 -0.546887
C  -1.563953 2.753854 0.061316
C  3.02299 -0.747285 1.340909
C  2.096502 -2.507492 2.895213
C  -0.938076 3.11847 -1.121206
C  -1.991824 3.737936 0.954772
C  -0.746041 4.469053 -1.422106
C  -1.802392 5.076524 0.669016
C  -1.178819 5.432524 -0.529062
C  1.269936 -4.0164 -1.288115
C  -0.074688 4.851879 -2.709506
C  -2.259972 6.141114 1.623255
H  -1.465657 -0.990093 1.171292
H  -0.333069 0.394344 -0.536778
H  -1.86272 0.557416 -1.422762
H  -2.033775 -2.31857 -1.381919
H  -3.795858 -0.120475 0.921851
H  -3.745545 -1.874588 0.754471
H  -3.909311 -0.848001 -0.675084
H  3.707251 -0.405234 2.117812
H  2.113979 -0.152013 1.394096
H  3.491969 -0.570962 0.372457
H  2.773547 -2.183907 3.686275
H  1.908408 -3.573957 3.022388
H  1.152753 -1.978411 3.008198
H  -2.474751 3.433777 1.875459
H  -1.029469 6.481181 -0.760973
H  0.926293 4.423288 -2.779074
H  -0.63889 4.49508 -3.572717
H  0.022481 5.932358 -2.804795
H  -3.015204 6.78255 1.166376
H  -1.431663 6.784154 1.924045
H  2.542134 -5.402498 -2.049284
H  0.996137 -5.30717 -2.839718
H  -0.58832 2.373394 -1.824451
H  -2.692219 5.714823 2.527199
totalener: -1111.26363971 hartree
nucrepener: 2047.80499443 hartree
electener: -3159.06863414 hartree
oneelecener: -5581.61539024 hartree
twoeener: 2422.54675611 hartree
kineticenergy: 1106.49826501 hartree
xcener: -106.884297179269 hartree
chargesum: -0.0000000
charge: -0.226269 -0.296779 -0.223245 -0.448887 -0.325069 -0.398787 -0.257402 0.128164 -0.021751 0.365490 -0.261368 0.158311 0.388423 0.331793 -0.304388 -0.305051 -0.206201 -0.258222 -0.010524 0.061477 -0.200241 0.361352 -0.221277 -0.216812 0.067023 0.104007 0.082831 0.138534 0.098551 0.103377 0.071175 0.092190 0.093312 0.099660 0.090821 0.100386 0.093576 0.097814 0.089053 0.097134 0.096614 0.077679 0.097634 0.096249 0.169581 0.161185 0.089803 0.079074
qa: -0.2263 -0.2968 -0.2232 -0.4489 -0.3251 -0.3988 -0.2574 0.1282 -0.0218 0.3655 -0.2614 0.1583 0.3884 0.3318 -0.3044 -0.3051 -0.2062 -0.2582 -0.0105 0.0615 -0.2002 0.3614 -0.2213 -0.2168 0.0670 0.1040 0.0828 0.1385 0.0986 0.1034 0.0712 0.0922 0.0933 0.0997 0.0908 0.1004 0.0936 0.0978 0.0891 0.0971 0.0966 0.0777 0.0976 0.0962 0.1696 0.1612 0.0898 0.0791
va: 1.0619 2.1006 3.1750 2.9504 3.0403 3.0161 3.1854 3.8982 3.8550 3.9002 3.9124 4.0963 4.2104 3.8557 3.9476 3.9480 3.8835 4.0583 3.8908 3.7754 3.9817 4.2920 3.9123 3.9071 1.0363 0.9964 0.9989 1.0485 1.0177 1.0062 1.0065 1.0095 1.0103 1.0099 1.0084 1.0104 1.0124 1.0250 1.0170 0.9955 0.9950 1.0097 0.9950 0.9963 1.0269 1.0309 1.0264 1.0094
dispcorr: -0.020329100 hartree
energy: -1111.283968808967
dipole: -12.26610 11.36151 -0.90459 23.18649 -23.18136 0.00513 1.55934 -2.30942 -0.75007
magnitude: 1.17513 au
magnitude: 2.98693 debye
