program: Orca
programVersion: 5.0.2
elementType: F O N N N N N C C C C C C C C C C C C C C C C C H H H H H H H H H H H H H H H H H H H H H H H H
charge: 0
multiplicity: 1
keywords: wb97x-d3
keywords: def2-TZVPP
keywords: def2/J RIJCOSX
keywords: DEFGRID2
keywords: scfconv7
keywords: smallprint printgap noloewdin
keywords: NOSOSCF
formula: C17H24FN5O
InChI: InChI=1/C17H24FN5O/c1-10-6-11(2)8-13(7-10)24-9-12(3)20-16-22-14(17(4,5)18)21-15(19)23-16/h6-8,12,20H,9,19H2,1-5H3
48 atoms
F  3.864429 -2.597372 1.33839
O  -1.982261 1.392057 0.331849
N  -1.56646 -2.088316 -0.655067
N  0.493937 -2.04009 0.35304
N  2.13971 -3.571855 -0.338614
N  -0.005254 -3.595289 -1.358521
N  1.629999 -5.057729 -1.99137
C  -2.070642 -0.971149 0.113573
C  -1.543649 0.332184 -0.481625
C  2.639603 -1.959989 1.421343
C  -3.589265 -1.025793 0.148387
C  1.703467 -2.579829 0.401522
C  -0.322205 -2.587748 -0.548672
C  -1.578524 2.647737 0.045845
C  2.8512 -0.487199 1.105884
C  2.090351 -2.171571 2.823845
C  -0.76017 2.98046 -1.023149
C  -2.037471 3.644995 0.908804
C  -0.396396 4.312121 -1.235895
C  -1.683934 4.965438 0.706729
C  -0.85981 5.28928 -0.373557
C  1.233363 -4.045067 -1.208872
C  0.490633 4.65899 -2.396592
C  -2.168047 6.043703 1.63211
H  -1.68178 -1.058927 1.130286
H  -0.449449 0.290785 -0.515809
H  -1.911978 0.444985 -1.510897
H  -2.146918 -2.499431 -1.366714
H  -3.991702 -0.201215 0.732248
H  -3.932253 -1.957298 0.598541
H  -4.014253 -0.955353 -0.856213
H  1.908723 0.054164 1.152771
H  3.271494 -0.358096 0.108074
H  3.540557 -0.044556 1.825353
H  2.765692 -1.738366 3.562177
H  1.981459 -3.234096 3.043181
H  1.11563 -1.699355 2.92673
H  -2.674668 3.365379 1.738944
H  -0.578952 6.323583 -0.538117
H  0.028175 4.384228 -3.346009
H  0.705543 5.72598 -2.43238
H  1.44441 4.132209 -2.338322
H  -2.712951 6.816472 1.088037
H  -1.333791 6.533478 2.136723
H  2.559381 -5.420487 -1.893981
H  0.997574 -5.459006 -2.657053
H  -0.392161 2.224725 -1.705336
H  -2.831953 5.649297 2.399951
totalener: -1111.26369861 hartree
nucrepener: 2062.42328542 hartree
electener: -3173.68698403 hartree
oneelecener: -5610.87037763 hartree
twoeener: 2437.18339360 hartree
kineticenergy: 1106.49954862 hartree
xcener: -106.885010124078 hartree
chargesum: -0.0000000
charge: -0.226208 -0.297213 -0.219606 -0.452251 -0.325386 -0.398600 -0.257653 0.122489 -0.006572 0.368210 -0.269065 0.157725 0.388642 0.328014 -0.307235 -0.305266 -0.205066 -0.258314 -0.008180 0.061334 -0.200212 0.360625 -0.221799 -0.217107 0.063982 0.095772 0.087344 0.139705 0.099888 0.104001 0.072448 0.093073 0.100134 0.093820 0.090780 0.100236 0.094367 0.097624 0.089033 0.096718 0.077965 0.096985 0.095644 0.097579 0.169853 0.161421 0.090967 0.079357
qa: -0.2262 -0.2972 -0.2196 -0.4523 -0.3254 -0.3986 -0.2577 0.1225 -0.0066 0.3682 -0.2691 0.1577 0.3886 0.3280 -0.3072 -0.3053 -0.2051 -0.2583 -0.0082 0.0613 -0.2002 0.3606 -0.2218 -0.2171 0.0640 0.0958 0.0873 0.1397 0.0999 0.1040 0.0724 0.0931 0.1001 0.0938 0.0908 0.1002 0.0944 0.0976 0.0890 0.0967 0.0780 0.0970 0.0956 0.0976 0.1699 0.1614 0.0910 0.0794
va: 1.0624 2.1012 3.1755 2.9454 3.0416 3.0177 3.1854 3.9012 3.8204 3.8961 3.9161 4.0962 4.2096 3.8608 3.9499 3.9466 3.8811 4.0573 3.8896 3.7762 3.9799 4.2930 3.9119 3.9076 1.0348 0.9959 1.0007 1.0479 1.0178 1.0058 1.0057 1.0066 1.0095 1.0105 1.0083 1.0106 1.0125 1.0246 1.0168 0.9951 1.0096 0.9955 0.9963 0.9950 1.0268 1.0308 1.0251 1.0093
dispcorr: -0.020597737 hartree
energy: -1111.284296350232
dipole: -11.34408 10.48388 -0.86020 22.71939 -22.82085 -0.10146 1.65035 -2.35066 -0.70030
magnitude: 1.11385 au
magnitude: 2.83118 debye
