program: Orca
programVersion: 5.0.2
elementType: F O N N N N N C C C C C C C C C C C C C C C C C H H H H H H H H H H H H H H H H H H H H H H H H
charge: 0
multiplicity: 1
keywords: wb97x-d3
keywords: def2-TZVPP
keywords: def2/J RIJCOSX
keywords: DEFGRID2
keywords: scfconv7
keywords: smallprint printgap noloewdin
keywords: NOSOSCF
formula: C17H24FN5O
InChI: InChI=1/C17H24FN5O/c1-10-6-11(2)8-13(7-10)24-9-12(3)20-16-22-14(17(4,5)18)21-15(19)23-16/h6-8,12,20H,9,19H2,1-5H3
48 atoms
F  3.990863 -3.793321 1.026857
O  -1.750078 1.464589 -0.007989
N  -1.188116 -1.319273 0.132047
N  0.886304 -2.079207 0.777509
N  2.044428 -3.55069 -0.648863
N  -0.078913 -2.706279 -1.290156
N  1.095458 -4.123146 -2.641087
C  -1.365805 -0.476981 1.291015
C  -0.926972 0.953993 1.012176
C  3.034132 -2.900289 1.474701
C  -2.806717 -0.557522 1.77866
C  1.913189 -2.852221 0.453814
C  -0.0919 -2.049999 -0.131137
C  -1.597121 2.743477 -0.409569
C  3.6835 -1.529268 1.589428
C  2.512854 -3.399805 2.812766
C  -2.475518 3.175602 -1.404814
C  -0.650342 3.616272 0.104351
C  -2.413524 4.470316 -1.883228
C  -0.58103 4.928098 -0.369807
C  -1.460934 5.343378 -1.353415
C  1.008044 -3.435008 -1.494647
C  -3.345729 4.936946 -2.96327
C  0.449765 5.864264 0.191733
H  -0.703355 -0.859219 2.068552
H  -1.0192 1.550492 1.929382
H  0.127266 0.961791 0.710024
H  -1.855229 -1.250651 -0.618806
H  -3.513027 -0.225572 1.017489
H  -2.951642 0.073165 2.655944
H  -3.058395 -1.580792 2.053837
H  4.500135 -1.55672 2.311554
H  2.955477 -0.790068 1.917549
H  4.087723 -1.208559 0.628944
H  3.324466 -3.444172 3.539613
H  2.085627 -4.398302 2.717386
H  1.741093 -2.734918 3.194255
H  0.043156 3.302894 0.874435
H  -1.410627 6.362899 -1.718846
H  -3.838334 5.869882 -2.687136
H  -2.806617 5.120936 -3.894162
H  -4.121085 4.201589 -3.173005
H  0.393768 5.912712 1.280097
H  0.322657 6.87597 -0.190627
H  1.904586 -4.688571 -2.815254
H  0.350555 -4.084381 -3.310168
H  -3.20901 2.479725 -1.793716
H  1.459837 5.540385 -0.064971
totalener: -1111.26393888 hartree
nucrepener: 2043.94292396 hartree
electener: -3155.20686284 hartree
oneelecener: -5573.93443317 hartree
twoeener: 2418.72757033 hartree
kineticenergy: 1106.51022130 hartree
xcener: -106.887543831179 hartree
chargesum: -0.0000000
charge: -0.225803 -0.302602 -0.213838 -0.453167 -0.327687 -0.399291 -0.258896 0.104254 -0.011610 0.357267 -0.261073 0.167411 0.391326 0.327502 -0.305231 -0.298985 -0.252032 -0.207688 0.058912 -0.003588 -0.199535 0.360352 -0.215492 -0.221284 0.076316 0.092149 0.100760 0.144523 0.091303 0.075949 0.100614 0.091130 0.087053 0.103110 0.090517 0.100481 0.089311 0.089544 0.089517 0.093767 0.099216 0.079793 0.093492 0.078692 0.168745 0.161523 0.093837 0.099437
qa: -0.2258 -0.3026 -0.2138 -0.4532 -0.3277 -0.3993 -0.2589 0.1043 -0.0116 0.3573 -0.2611 0.1674 0.3913 0.3275 -0.3052 -0.2990 -0.2520 -0.2077 0.0589 -0.0036 -0.1995 0.3604 -0.2155 -0.2213 0.0763 0.0921 0.1008 0.1445 0.0913 0.0759 0.1006 0.0911 0.0871 0.1031 0.0905 0.1005 0.0893 0.0895 0.0895 0.0938 0.0992 0.0798 0.0935 0.0787 0.1687 0.1615 0.0938 0.0994
va: 1.0618 2.0975 3.2028 2.9502 3.0359 3.0104 3.1847 3.9627 3.8683 3.9113 3.9494 4.0862 4.2116 3.8607 3.9451 3.9497 4.0596 3.8963 3.7796 3.8825 3.9834 4.2952 3.9069 3.9108 1.0338 0.9929 0.9950 1.0475 1.0109 1.0098 1.0080 1.0086 1.0134 1.0105 1.0083 1.0106 1.0130 1.0258 1.0169 0.9981 0.9938 1.0089 0.9970 1.0093 1.0274 1.0309 1.0255 0.9938
dispcorr: -0.020273910 hartree
energy: -1111.284212788593
dipole: -9.86290 9.11700 -0.74590 23.16676 -22.55949 0.60727 6.35063 -6.38390 -0.03327
magnitude: 0.96242 au
magnitude: 2.44628 debye
