program: Orca
programVersion: 5.0.2
elementType: F O N N N N N C C C C C C C C C C C C C C C C C H H H H H H H H H H H H H H H H H H H H H H H H
charge: 0
multiplicity: 1
keywords: wb97x-d3
keywords: def2-TZVPP
keywords: def2/J RIJCOSX
keywords: DEFGRID2
keywords: scfconv7
keywords: smallprint printgap noloewdin
keywords: NOSOSCF
formula: C17H24FN5O
InChI: InChI=1/C17H24FN5O/c1-10-6-11(2)8-13(7-10)24-9-12(3)20-16-22-14(17(4,5)18)21-15(19)23-16/h6-8,12,20H,9,19H2,1-5H3
48 atoms
F  3.545038 -4.356369 1.936958
O  -1.824905 1.555387 -0.372132
N  -0.556034 -0.963277 -0.399332
N  0.901916 -2.245606 0.841498
N  2.528511 -3.517701 -0.288555
N  0.996261 -2.188081 -1.521737
N  2.584412 -3.450641 -2.567451
C  -1.288012 -0.465224 0.740807
C  -1.213673 1.052116 0.79167
C  2.418432 -3.580071 2.141671
C  -2.722615 -0.983664 0.749665
C  1.927644 -3.082709 0.794105
C  0.474252 -1.823505 -0.351391
C  -1.842899 2.887703 -0.589035
C  2.808798 -2.411766 3.032918
C  1.350427 -4.454725 2.780711
C  -1.309158 3.826024 0.280212
C  -2.448971 3.302057 -1.776388
C  -1.37758 5.18552 -0.032641
C  -2.524527 4.644476 -2.094288
C  -1.984289 5.581881 -1.210852
C  2.013175 -3.032104 -1.429448
C  -0.786699 6.190237 0.913236
C  -3.175748 5.098591 -3.367921
H  -0.772889 -0.836111 1.627352
H  -1.724445 1.417484 1.692007
H  -0.163806 1.363632 0.848892
H  -0.839386 -0.671245 -1.32052
H  -3.271212 -0.674563 -0.13982
H  -3.264584 -0.610896 1.619826
H  -2.728569 -2.072069 0.791557
H  3.171935 -2.777094 3.993971
H  1.953445 -1.763598 3.208606
H  3.59885 -1.817252 2.573388
H  1.110169 -5.3052 2.142096
H  0.439064 -3.882952 2.944926
H  1.698726 -4.836736 3.741001
H  -2.860023 2.554188 -2.44354
H  -2.040271 6.636975 -1.45422
H  -0.921028 7.208723 0.55213
H  -1.247254 6.126607 1.900318
H  0.283902 6.026184 1.045712
H  -2.475866 5.655252 -3.992739
H  -4.021135 5.758048 -3.165917
H  3.372115 -4.069086 -2.524579
H  2.2622 -3.102828 -3.450226
H  -0.833607 3.527887 1.206024
H  -3.545467 4.258743 -3.954283
totalener: -1111.26395328 hartree
nucrepener: 2021.82929290 hartree
electener: -3133.09324618 hartree
oneelecener: -5529.66013616 hartree
twoeener: 2396.56688998 hartree
kineticenergy: 1106.50651669 hartree
xcener: -106.887092026314 hartree
chargesum: 0.0000000
charge: -0.226132 -0.309291 -0.212493 -0.447576 -0.328403 -0.398803 -0.258482 0.074378 0.005077 0.356439 -0.256656 0.172027 0.391088 0.331206 -0.297195 -0.306416 -0.205593 -0.252831 -0.003279 0.059294 -0.202761 0.359764 -0.220981 -0.214994 0.076789 0.088906 0.101578 0.146716 0.092103 0.075550 0.097092 0.089990 0.087831 0.100334 0.102751 0.090172 0.090069 0.096399 0.090389 0.078566 0.095973 0.097619 0.096932 0.097008 0.168493 0.160800 0.091006 0.079549
qa: -0.2261 -0.3093 -0.2125 -0.4476 -0.3284 -0.3988 -0.2585 0.0744 0.0051 0.3564 -0.2567 0.1720 0.3911 0.3312 -0.2972 -0.3064 -0.2056 -0.2528 -0.0033 0.0593 -0.2028 0.3598 -0.2210 -0.2150 0.0768 0.0889 0.1016 0.1467 0.0921 0.0755 0.0971 0.0900 0.0878 0.1003 0.1028 0.0902 0.0901 0.0964 0.0904 0.0786 0.0960 0.0976 0.0969 0.0970 0.1685 0.1608 0.0910 0.0795
va: 1.0613 2.0913 3.2106 2.9605 3.0363 3.0027 3.1828 3.9534 3.8940 3.9076 3.9547 4.0797 4.2186 3.8525 3.9499 3.9437 3.8984 4.0580 3.8884 3.7803 3.9833 4.2948 3.9115 3.9069 1.0437 0.9921 0.9953 1.0508 1.0125 1.0096 1.0082 1.0085 1.0140 1.0103 1.0110 1.0140 1.0082 1.0243 1.0169 1.0097 0.9956 0.9949 0.9958 0.9957 1.0275 1.0312 1.0243 1.0094
dispcorr: -0.020031163 hartree
energy: -1111.283984438572
dipole: -15.26130 14.58888 -0.67242 20.81703 -20.01938 0.79765 5.17873 -5.39559 -0.21686
magnitude: 1.06556 au
magnitude: 2.70844 debye
