program: Orca
programVersion: 5.0.2
elementType: F O N N N N N C C C C C C C C C C C C C C C C C H H H H H H H H H H H H H H H H H H H H H H H H
charge: 0
multiplicity: 1
keywords: wb97x-d3
keywords: def2-TZVPP
keywords: def2/J RIJCOSX
keywords: DEFGRID2
keywords: scfconv7
keywords: smallprint printgap noloewdin
keywords: NOSOSCF
formula: C17H24FN5O
InChI: InChI=1/C17H24FN5O/c1-10-6-11(2)8-13(7-10)24-9-12(3)20-16-22-14(17(4,5)18)21-15(19)23-16/h6-8,12,20H,9,19H2,1-5H3
48 atoms
F  2.535619 -1.92825 2.517048
O  -1.957025 1.242756 0.060461
N  -1.393234 -1.54299 -0.05773
N  0.715502 -2.068014 0.682784
N  2.185658 -3.166858 -0.789782
N  0.017868 -2.562571 -1.528784
N  1.48855 -3.621657 -2.917625
C  -1.743046 -0.844241 1.159693
C  -1.282495 0.605898 1.119691
C  2.924928 -2.726334 1.454226
C  -3.238204 -0.976057 1.413236
C  1.863946 -2.631735 0.374441
C  -0.184353 -2.069128 -0.30937
C  -1.692283 2.536392 -0.211242
C  3.002783 -4.16421 1.946126
C  4.266677 -2.218723 0.955403
C  -2.407078 3.091272 -1.27462
C  -0.781169 3.311831 0.48938
C  -2.214209 4.409697 -1.6393
C  -0.578598 4.645788 0.128847
C  -1.29293 5.181475 -0.927917
C  1.217377 -3.096905 -1.7116
C  -2.973947 5.009886 -2.786268
C  0.405499 5.47831 0.898257
H  -1.196356 -1.318681 1.975977
H  -1.507978 1.091251 2.07851
H  -0.196341 0.636558 0.976586
H  -2.003432 -1.452979 -0.853518
H  -3.516024 -2.023111 1.528525
H  -3.827899 -0.552874 0.599436
H  -3.518388 -0.451019 2.326479
H  2.037317 -4.49693 2.328351
H  3.736613 -4.252699 2.748061
H  3.295951 -4.827785 1.134644
H  4.614706 -2.817073 0.117072
H  5.006213 -2.273006 1.755038
H  4.195653 -1.181873 0.625883
H  -0.216283 2.903488 1.317711
H  -1.136052 6.217015 -1.208279
H  -2.301559 5.298793 -3.595633
H  -3.702585 4.31228 -3.196747
H  -3.511748 5.907597 -2.478392
H  1.389616 5.008318 0.924291
H  0.085907 5.613976 1.932945
H  2.416962 -3.944047 -3.113911
H  0.83156 -3.506027 -3.665681
H  -3.115341 2.469533 -1.80867
H  0.523542 6.4676 0.458529
totalener: -1111.26472035 hartree
nucrepener: 2059.98810734 hartree
electener: -3171.25282768 hartree
oneelecener: -5606.33993663 hartree
twoeener: 2435.08710894 hartree
kineticenergy: 1106.51015098 hartree
xcener: -106.886742304369 hartree
chargesum: 0.0000000
charge: -0.231321 -0.302027 -0.208868 -0.375925 -0.420721 -0.397142 -0.265362 0.123316 -0.027005 0.351943 -0.266614 0.179242 0.392826 0.327044 -0.312315 -0.286459 -0.252452 -0.208472 0.059583 -0.004655 -0.202676 0.355761 -0.216447 -0.221408 0.083611 0.097294 0.110666 0.143218 0.101625 0.088477 0.076750 0.102820 0.090675 0.094863 0.090922 0.089841 0.096861 0.093678 0.089027 0.097659 0.078447 0.095506 0.096053 0.098146 0.161738 0.162072 0.092840 0.077366
qa: -0.2313 -0.3020 -0.2089 -0.3759 -0.4207 -0.3971 -0.2654 0.1233 -0.0270 0.3519 -0.2666 0.1792 0.3928 0.3270 -0.3123 -0.2865 -0.2525 -0.2085 0.0596 -0.0047 -0.2027 0.3558 -0.2164 -0.2214 0.0836 0.0973 0.1107 0.1432 0.1016 0.0885 0.0767 0.1028 0.0907 0.0949 0.0909 0.0898 0.0969 0.0937 0.0890 0.0977 0.0784 0.0955 0.0961 0.0981 0.1617 0.1621 0.0928 0.0774
va: 1.0529 2.0930 3.2044 2.9985 2.9818 3.0116 3.1844 3.9277 3.8290 3.9121 3.9418 4.0788 4.1928 3.8627 3.9391 3.9414 4.0581 3.8975 3.7783 3.8814 3.9837 4.3080 3.9070 3.9118 1.0349 0.9950 1.0001 1.0465 1.0074 1.0109 1.0097 1.0114 1.0078 1.0141 1.0219 1.0082 1.0106 1.0250 1.0169 0.9948 1.0094 0.9967 0.9966 0.9943 1.0316 1.0310 1.0261 1.0092
dispcorr: -0.020143410 hartree
energy: -1111.284863755952
dipole: -3.93724 3.93043 -0.00681 13.68378 -13.89755 -0.21378 0.36513 -1.08671 -0.72158
magnitude: 0.75261 au
magnitude: 1.91300 debye
