program: Orca
programVersion: 5.0.2
elementType: F O N N N N N C C C C C C C C C C C C C C C C C H H H H H H H H H H H H H H H H H H H H H H H H
charge: 0
multiplicity: 1
keywords: wb97x-d3
keywords: def2-TZVPP
keywords: def2/J RIJCOSX
keywords: DEFGRID2
keywords: scfconv7
keywords: smallprint printgap noloewdin
keywords: NOSOSCF
formula: C17H24FN5O
InChI: InChI=1/C17H24FN5O/c1-10-6-11(2)8-13(7-10)24-9-12(3)20-16-22-14(17(4,5)18)21-15(19)23-16/h6-8,12,20H,9,19H2,1-5H3
48 atoms
F  2.683875 -1.765995 2.41736
O  -1.861287 1.272836 -0.062667
N  -1.315079 -1.52772 -0.081222
N  0.796697 -2.040987 0.659655
N  2.193869 -3.324773 -0.73241
N  0.028477 -2.722754 -1.478299
N  1.427172 -3.96426 -2.786582
C  -1.653186 -0.779046 1.108425
C  -1.193104 0.668581 1.01929
C  3.01295 -2.681771 1.431754
C  -3.147652 -0.896558 1.376205
C  1.920693 -2.665658 0.379158
C  -0.128042 -2.109797 -0.307417
C  -1.677935 2.586953 -0.301332
C  3.063809 -4.06368 2.067711
C  4.351988 -2.271988 0.842542
C  -2.373977 3.10899 -1.393396
C  -0.867502 3.414228 0.46129
C  -2.267654 4.447104 -1.720345
C  -0.758951 4.76986 0.143981
C  -1.456295 5.273321 -0.939598
C  1.204568 -3.313966 -1.634156
C  -3.000915 5.010821 -2.902484
C  0.107069 5.658241 0.989231
H  -1.103197 -1.223169 1.939636
H  -1.427901 1.17794 1.963099
H  -0.106236 0.701605 0.882167
H  -1.947249 -1.502765 -0.86401
H  -3.431588 -1.93905 1.515206
H  -3.740766 -0.485702 0.5586
H  -3.417502 -0.351632 2.280669
H  3.826184 -4.095936 2.846805
H  3.302279 -4.817155 1.319207
H  2.103938 -4.319237 2.517407
H  4.303589 -1.266943 0.422791
H  4.646816 -2.955646 0.050274
H  5.119816 -2.281976 1.616661
H  -0.312687 3.031219 1.308339
H  -1.372627 6.325762 -1.186621
H  -2.305334 5.319324 -3.684826
H  -3.683803 4.283165 -3.338647
H  -3.584907 5.889615 -2.626276
H  0.120291 6.680483 0.614053
H  1.137896 5.30172 1.014263
H  2.325234 -4.373884 -2.95862
H  0.737459 -3.941414 -3.513268
H  -3.000133 2.446856 -1.979094
H  -0.247731 5.690587 2.020759
totalener: -1111.26455632 hartree
nucrepener: 2052.52521046 hartree
electener: -3163.78976678 hartree
oneelecener: -5591.44234922 hartree
twoeener: 2427.65258244 hartree
kineticenergy: 1106.51029632 hartree
xcener: -106.887213856886 hartree
chargesum: -0.0000000
charge: -0.231513 -0.301226 -0.206659 -0.376198 -0.420619 -0.398730 -0.266649 0.115739 -0.021567 0.351977 -0.267577 0.177649 0.398337 0.327729 -0.312907 -0.285849 -0.253713 -0.209045 0.061349 -0.005720 -0.201914 0.356412 -0.216178 -0.221678 0.081983 0.092282 0.116055 0.142608 0.102027 0.089361 0.076834 0.090574 0.095075 0.102571 0.096784 0.091171 0.089010 0.093828 0.088686 0.098349 0.079116 0.093666 0.077054 0.097479 0.162238 0.162714 0.092177 0.096912
qa: -0.2315 -0.3012 -0.2067 -0.3762 -0.4206 -0.3987 -0.2666 0.1157 -0.0216 0.3520 -0.2676 0.1776 0.3983 0.3277 -0.3129 -0.2858 -0.2537 -0.2090 0.0613 -0.0057 -0.2019 0.3564 -0.2162 -0.2217 0.0820 0.0923 0.1161 0.1426 0.1020 0.0894 0.0768 0.0906 0.0951 0.1026 0.0968 0.0912 0.0890 0.0938 0.0887 0.0983 0.0791 0.0937 0.0771 0.0975 0.1622 0.1627 0.0922 0.0969
va: 1.0529 2.0951 3.2011 3.0009 2.9801 3.0119 3.1844 3.9403 3.8207 3.9105 3.9377 4.0823 4.1853 3.8634 3.9384 3.9418 4.0608 3.8955 3.7756 3.8819 3.9833 4.3092 3.9069 3.9120 1.0354 0.9940 1.0009 1.0466 1.0073 1.0108 1.0100 1.0078 1.0142 1.0116 1.0109 1.0221 1.0080 1.0253 1.0172 0.9941 1.0090 0.9978 1.0095 0.9959 1.0315 1.0308 1.0264 0.9949
dispcorr: -0.020049869 hartree
energy: -1111.284606186663
dipole: -4.72438 4.62109 -0.10329 13.79026 -14.16854 -0.37828 0.72505 -1.37575 -0.65070
magnitude: 0.75972 au
magnitude: 1.93106 debye
