program: Orca
programVersion: 5.0.2
elementType: F O N N N N N C C C C C C C C C C C C C C C C C H H H H H H H H H H H H H H H H H H H H H H H H
charge: 0
multiplicity: 1
keywords: wb97x-d3
keywords: def2-TZVPP
keywords: def2/J RIJCOSX
keywords: DEFGRID2
keywords: scfconv7
keywords: smallprint printgap noloewdin
keywords: NOSOSCF
formula: C17H24FN5O
InChI: InChI=1/C17H24FN5O/c1-10-6-11(2)8-13(7-10)24-9-12(3)20-16-22-14(17(4,5)18)21-15(19)23-16/h6-8,12,20H,9,19H2,1-5H3
48 atoms
F  2.689272 -2.19177 2.630288
O  -1.833135 1.422295 -0.092647
N  -1.042221 -1.320145 -0.112681
N  0.937239 -2.1287 0.729876
N  2.257613 -3.515712 -0.637449
N  0.229319 -2.625632 -1.477087
N  1.54682 -3.976847 -2.759611
C  -1.372503 -0.582877 1.085412
C  -1.032549 0.892824 0.937504
C  3.008201 -3.059731 1.599293
C  -2.832563 -0.810393 1.457302
C  1.992796 -2.874386 0.487312
C  0.074467 -2.041796 -0.291248
C  -1.772195 2.741038 -0.369744
C  2.912556 -4.481714 2.13264
C  4.409232 -2.721849 1.118202
C  -2.648597 3.19457 -1.357312
C  -0.916102 3.632965 0.257818
C  -2.673572 4.528446 -1.716345
C  -0.935383 4.98417 -0.095112
C  -1.8104 5.419188 -1.074536
C  1.334143 -3.3496 -1.592177
C  -3.609562 5.020931 -2.781667
C  -0.013225 5.943221 0.60084
H  -0.733284 -0.969626 1.879616
H  -1.223005 1.408942 1.887357
H  0.033508 1.000091 0.705011
H  -1.630148 -1.213863 -0.923126
H  -3.01591 -1.86745 1.644992
H  -3.510351 -0.481461 0.669052
H  -3.09034 -0.258477 2.36181
H  1.910437 -4.688382 2.509714
H  3.621479 -4.630305 2.947921
H  3.13584 -5.198685 1.344624
H  5.125629 -2.852636 1.929893
H  4.466386 -1.68843 0.774578
H  4.695943 -3.369412 0.292762
H  -0.22407 3.303781 1.022637
H  -1.826394 6.468102 -1.348744
H  -4.25446 4.224967 -3.151003
H  -4.250822 5.820421 -2.408125
H  -3.059449 5.421978 -3.634465
H  -0.25041 6.019355 1.663398
H  -0.081296 6.943931 0.176786
H  2.401927 -4.479261 -2.903021
H  0.916273 -3.831606 -3.524921
H  -3.310349 2.483345 -1.836678
H  1.026644 5.622148 0.525492
totalener: -1111.26464774 hartree
nucrepener: 2033.95002006 hartree
electener: -3145.21466780 hartree
oneelecener: -5554.21044711 hartree
twoeener: 2408.99577931 hartree
kineticenergy: 1106.50647011 hartree
xcener: -106.886696789973 hartree
chargesum: -0.0000000
charge: -0.230931 -0.304147 -0.206856 -0.364422 -0.420698 -0.399043 -0.266495 0.094463 -0.011927 0.353337 -0.258612 0.174433 0.395170 0.326762 -0.310542 -0.289200 -0.251073 -0.207912 0.058543 -0.001831 -0.202417 0.355624 -0.215975 -0.220905 0.089696 0.092501 0.105425 0.144266 0.098536 0.088752 0.076632 0.101931 0.090141 0.094761 0.088821 0.096820 0.092175 0.093003 0.089513 0.079294 0.095408 0.097589 0.097862 0.077539 0.162017 0.162270 0.093558 0.096147
qa: -0.2309 -0.3041 -0.2069 -0.3644 -0.4207 -0.3990 -0.2665 0.0945 -0.0119 0.3533 -0.2586 0.1744 0.3952 0.3268 -0.3105 -0.2892 -0.2511 -0.2079 0.0585 -0.0018 -0.2024 0.3556 -0.2160 -0.2209 0.0897 0.0925 0.1054 0.1443 0.0985 0.0888 0.0766 0.1019 0.0901 0.0948 0.0888 0.0968 0.0922 0.0930 0.0895 0.0793 0.0954 0.0976 0.0979 0.0775 0.1620 0.1623 0.0936 0.0961
va: 1.0539 2.0959 3.2056 3.0111 2.9750 3.0072 3.1835 3.9413 3.8805 3.9042 3.9520 4.0940 4.1924 3.8625 3.9379 3.9412 4.0578 3.8959 3.7803 3.8786 3.9838 4.3099 3.9066 3.9117 1.0434 0.9935 0.9954 1.0472 1.0082 1.0109 1.0098 1.0115 1.0077 1.0150 1.0081 1.0107 1.0212 1.0248 1.0169 1.0092 0.9965 0.9950 0.9944 1.0093 1.0315 1.0310 1.0254 0.9964
dispcorr: -0.019874053 hartree
energy: -1111.284521788525
dipole: -5.62176 5.56492 -0.05684 14.23399 -14.43073 -0.19674 0.22463 -0.94533 -0.72070
magnitude: 0.74923 au
magnitude: 1.90438 debye
