program: Orca
programVersion: 5.0.2
elementType: F O N N N N N C C C C C C C C C C C C C C C C C H H H H H H H H H H H H H H H H H H H H H H H H
charge: 0
multiplicity: 1
keywords: wb97x-d3
keywords: def2-TZVPP
keywords: def2/J RIJCOSX
keywords: DEFGRID2
keywords: scfconv7
keywords: smallprint printgap noloewdin
keywords: NOSOSCF
formula: C17H24FN5O
InChI: InChI=1/C17H24FN5O/c1-10-6-11(2)8-13(7-10)24-9-12(3)20-16-22-14(17(4,5)18)21-15(19)23-16/h6-8,12,20H,9,19H2,1-5H3
48 atoms
F  4.101956 -2.063628 -0.071851
O  -2.951297 1.53246 -0.084382
N  -1.696424 -1.910857 -0.38343
N  0.570402 -1.695508 -0.03873
N  2.009774 -3.326669 -0.935451
N  -0.331647 -3.489368 -1.289401
N  1.113444 -5.028015 -2.1601
C  -2.05503 -0.708493 0.33365
C  -2.594077 0.310006 -0.676806
C  2.924946 -1.520898 0.411533
C  -3.059899 -1.01143 1.435909
C  1.762037 -2.234574 -0.251384
C  -0.447381 -2.372219 -0.574153
C  -2.016841 2.486709 0.135593
C  2.917098 -0.038988 0.080755
C  2.869429 -1.770309 1.911924
C  -2.496417 3.656726 0.723134
C  -0.672166 2.379843 -0.19716
C  -1.649983 4.723334 0.96626
C  0.186625 3.456351 0.031158
C  -0.307207 4.615069 0.60772
C  0.914888 -3.91428 -1.44254
C  -2.164117 5.985186 1.595757
C  1.641201 3.348138 -0.326701
H  -1.138008 -0.324113 0.78074
H  -1.87408 0.44389 -1.491181
H  -3.513295 -0.07827 -1.125418
H  -2.428195 -2.47599 -0.78298
H  -3.977493 -1.445335 1.030912
H  -3.33432 -0.106291 1.974975
H  -2.640157 -1.718103 2.150825
H  2.988637 0.122999 -0.995298
H  3.764104 0.4567 0.556141
H  2.000205 0.426021 0.435128
H  2.922964 -2.837282 2.129889
H  1.942514 -1.380974 2.329046
H  3.706096 -1.278161 2.408857
H  -0.264965 1.476448 -0.634692
H  0.361521 5.450853 0.782294
H  -1.644766 6.19964 2.530952
H  -2.013434 6.844004 0.940012
H  -3.228592 5.921528 1.816537
H  1.804045 2.659761 -1.155373
H  2.229038 2.982648 0.517612
H  2.047161 -5.36725 -2.294475
H  0.336364 -5.51074 -2.569087
H  -3.547904 3.720436 0.975456
H  2.053405 4.315341 -0.612671
totalener: -1111.26053950 hartree
nucrepener: 2108.52846892 hartree
electener: -3219.78900842 hartree
oneelecener: -5702.96488634 hartree
twoeener: 2483.17587792 hartree
kineticenergy: 1106.50288575 hartree
xcener: -106.887152032747 hartree
chargesum: -0.0000000
charge: -0.226059 -0.299696 -0.205229 -0.438551 -0.329282 -0.401094 -0.257204 0.032448 0.009105 0.375995 -0.251117 0.162737 0.390071 0.301061 -0.311780 -0.311733 -0.256670 -0.191509 0.063667 0.050567 -0.221473 0.360533 -0.217418 -0.274139 0.094914 0.101616 0.104767 0.135558 0.071655 0.096138 0.097622 0.103822 0.098081 0.081538 0.104675 0.093313 0.090999 0.089136 0.090728 0.096655 0.096671 0.079995 0.092697 0.101352 0.169729 0.161287 0.097723 0.096099
qa: -0.2261 -0.2997 -0.2052 -0.4386 -0.3293 -0.4011 -0.2572 0.0324 0.0091 0.3760 -0.2511 0.1627 0.3901 0.3011 -0.3118 -0.3117 -0.2567 -0.1915 0.0637 0.0506 -0.2215 0.3605 -0.2174 -0.2741 0.0949 0.1016 0.1048 0.1356 0.0717 0.0961 0.0976 0.1038 0.0981 0.0815 0.1047 0.0933 0.0910 0.0891 0.0907 0.0967 0.0967 0.0800 0.0927 0.1014 0.1697 0.1613 0.0977 0.0961
va: 1.0625 2.1023 3.1588 2.9664 3.0422 3.0061 3.1864 3.8391 3.9124 3.9096 3.9531 4.0945 4.2165 3.8936 3.9686 3.9393 4.0734 3.8697 3.7848 3.7329 4.0101 4.2963 3.9061 3.9341 1.0315 1.0056 0.9981 1.0494 1.0075 1.0158 1.0079 1.0092 1.0102 1.0070 1.0118 1.0127 1.0078 1.0254 1.0155 0.9959 0.9959 1.0091 0.9974 0.9865 1.0268 1.0310 1.0272 1.0074
dispcorr: -0.023006455 hartree
energy: -1111.283545958557
dipole: -7.04207 6.24985 -0.79222 19.43616 -19.78933 -0.35316 9.33499 -9.43242 -0.09743
magnitude: 0.87283 au
magnitude: 2.21855 debye
