program: Orca
programVersion: 5.0.2
elementType: O O O O N N C C C C C C C C C C C C C C C C C C H H H H H H H H H H H H H H H H H H H H H H H H
charge: 0
multiplicity: 1
keywords: wb97x-d3
keywords: def2-TZVPP
keywords: def2/J RIJCOSX
keywords: DEFGRID2
keywords: scfconv7
keywords: smallprint printgap noloewdin
keywords: NOSOSCF
formula: C18H24N2O4
InChI: InChI=1/C18H24N2O4/c1-6-18(3,7-2)14-11-15(24-20-14)19-17(21)16-12(22-4)9-8-10-13(16)23-5/h8-11,19H,6-7H2,1-5H3
48 atoms
O  0.790529 2.420261 0.575771
O  -3.144274 0.937092 2.070277
O  -2.279375 -1.902164 2.115241
O  -1.882847 1.273993 -1.235719
N  1.971215 2.106024 -0.048813
N  -1.011347 1.4527 1.61528
C  3.213229 0.096787 -0.699603
C  2.943354 0.024037 -2.219609
C  4.52154 0.881882 -0.493904
C  2.05666 0.804838 -0.042048
C  3.354999 -1.313768 -0.1270
C  1.635852 -0.633513 -2.634757
C  4.992269 1.015819 0.94668
C  0.938608 0.223706 0.612716
C  0.187116 1.293691 0.960663
C  -2.14101 0.714567 1.419029
C  -2.087753 -0.361849 0.390994
C  -2.207572 -1.694559 0.788438
C  -1.990785 -0.038076 -0.963205
C  -2.216253 -2.70669 -0.167685
C  -2.006017 -1.04443 -1.924405
C  -2.116355 -2.361237 -1.506326
C  -2.400587 -3.23334 2.589054
C  -1.771446 1.68622 -2.588414
H  2.975206 1.039686 -2.62448
H  3.78072 -0.513397 -2.67486
H  5.297446 0.377338 -1.077115
H  4.224659 -1.803996 -0.568487
H  2.486169 -1.936948 -0.338842
H  3.491236 -1.306714 0.954746
H  0.7703 -0.10927 -2.228335
H  1.536934 -0.622925 -3.72098
H  1.571008 -1.674585 -2.315281
H  4.235983 1.473518 1.585669
H  5.257067 0.052974 1.384036
H  5.881327 1.645592 0.99617
H  -1.103205 2.263337 2.218913
H  -2.297482 -3.747829 0.109954
H  -1.93193 -0.821699 -2.979161
H  -2.125206 -3.146825 -2.250378
H  -2.457002 -3.167657 3.672631
H  -1.534502 -3.840763 2.317738
H  -3.307899 -3.714219 2.217605
H  -0.885635 1.267089 -3.06982
H  -2.65779 1.416461 -3.166502
H  -1.680736 2.769206 -2.569252
H  0.740992 -0.817165 0.798933
H  4.414471 1.875784 -0.93468
elementType: O N C H
totalener: -1110.84229851 hartree
nucrepener: 2240.96844395 hartree
electener: -3351.81074246 hartree
oneelecener: -5966.85779306 hartree
twoeener: 2615.04705060 hartree
cpcmener: -0.04354998 hartree
kineticenergy: 1106.01621223 hartree
xcener: -106.818960508068 hartree
chargesum: -0.0000000
charge: -0.162892 -0.476546 -0.326596 -0.329861 -0.209537 -0.137013 0.488869 -0.147325 -0.169341 -0.123967 -0.413122 -0.266763 -0.294424 -0.253567 0.268853 0.320261 -0.250992 0.361581 0.450277 -0.290418 -0.352489 -0.107048 -0.130131 -0.131303 0.080311 0.082524 0.081973 0.108720 0.101983 0.117990 0.029837 0.106143 0.091861 0.086289 0.085264 0.098207 0.188753 0.144830 0.145305 0.162920 0.123337 0.115436 0.115922 0.113054 0.125303 0.126314 0.174915 0.076305
qa: -0.1629 -0.4765 -0.3266 -0.3299 -0.2095 -0.1370 0.4889 -0.1473 -0.1693 -0.1240 -0.4131 -0.2668 -0.2944 -0.2536 0.2689 0.3203 -0.2510 0.3616 0.4503 -0.2904 -0.3525 -0.1070 -0.1301 -0.1313 0.0803 0.0825 0.0820 0.1087 0.1020 0.1180 0.0298 0.1061 0.0919 0.0863 0.0853 0.0982 0.1888 0.1448 0.1453 0.1629 0.1233 0.1154 0.1159 0.1131 0.1253 0.1263 0.1749 0.0763
va: 2.2098 2.0289 2.0684 2.0677 2.8086 3.1938 3.4954 3.8661 3.8283 4.0932 3.9576 3.9604 3.9487 3.8356 4.0513 4.2620 3.4968 3.8578 3.6689 3.9284 3.9205 3.8988 3.8708 3.8621 1.0125 1.0084 1.0080 1.0014 0.9998 0.9931 0.9890 1.0048 1.0013 1.0029 0.9973 1.0031 1.0128 1.0078 1.0080 0.9882 0.9935 0.9857 0.9854 0.9777 0.9874 0.9933 0.9799 1.0209
dispcorr: -0.027443869 hartree
energy: -1110.869742378647
dipole: 25.28014 -24.16705 1.11309 -12.21336 9.72412 -2.48924 -13.04725 11.55968 -1.48757
magnitude: 3.10615 au
magnitude: 7.89521 debye
