program: Orca
programVersion: 5.0.2
elementType: O O O O N N C C C C C C C C C C C C C C C C C C H H H H H H H H H H H H H H H H H H H H H H H H
charge: 0
multiplicity: 1
keywords: wb97x-d3
keywords: def2-TZVPP
keywords: def2/J RIJCOSX
keywords: DEFGRID2
keywords: scfconv7
keywords: smallprint printgap noloewdin
keywords: NOSOSCF
formula: C18H24N2O4
InChI: InChI=1/C18H24N2O4/c1-6-18(3,7-2)14-11-15(24-20-14)19-17(21)16-12(22-4)9-8-10-13(16)23-5/h8-11,19H,6-7H2,1-5H3
48 atoms
O  0.352858 0.941804 -0.481777
O  -2.997611 1.342973 1.882196
O  -1.138017 -1.662344 1.229815
O  -3.423712 1.707758 -0.994548
N  1.602834 0.600744 -0.942461
N  -0.788854 1.258894 1.520075
C  3.777378 -0.028365 0.016715
C  4.626287 0.938809 0.866715
C  3.915527 -1.437003 0.632327
C  2.337513 0.384975 0.110856
C  4.269798 -0.031847 -1.428574
C  4.539261 2.407895 0.482496
C  3.105589 -2.531309 -0.044534
C  1.584775 0.558488 1.30268
C  0.357274 0.899527 0.851295
C  -2.07344 0.907629 1.220737
C  -2.292707 -0.016285 0.07331
C  -1.834218 -1.334703 0.127445
C  -3.038152 0.42022 -1.024596
C  -2.117378 -2.216785 -0.911559
C  -3.317695 -0.455398 -2.070217
C  -2.852849 -1.758629 -1.992881
C  -0.628309 -2.980185 1.349432
C  -4.186552 2.212818 -2.077802
H  4.341082 0.827406 1.916976
H  5.666208 0.606267 0.800838
H  4.976556 -1.703057 0.612355
H  4.212958 0.955078 -1.887351
H  3.703014 -0.713741 -2.061312
H  5.313889 -0.348902 -1.454583
H  4.886177 2.591702 -0.534669
H  3.520574 2.791303 0.561477
H  5.160695 3.008318 1.147643
H  3.412823 -2.694971 -1.077912
H  3.233107 -3.476726 0.483816
H  2.037647 -2.305367 -0.046771
H  -0.653159 1.7522 2.394879
H  -1.78109 -3.24339 -0.889996
H  -3.884645 -0.141256 -2.934712
H  -3.072916 -2.441445 -2.802792
H  -0.056572 -3.002916 2.273639
H  0.032547 -3.239888 0.520272
H  -1.431701 -3.717551 1.41168
H  -5.132607 1.679352 -2.19098
H  -4.397139 3.253282 -1.843399
H  -3.634065 2.168804 -3.018785
H  1.902729 0.434612 2.323966
H  3.636138 -1.384817 1.688821
elementType: O N C H
totalener: -1110.84324107 hartree
nucrepener: 2209.57030648 hartree
electener: -3320.41354755 hartree
oneelecener: -5904.99458560 hartree
twoeener: 2584.58103805 hartree
cpcmener: -0.04806284 hartree
kineticenergy: 1106.02525331 hartree
xcener: -106.818523980860 hartree
chargesum: 0.0000000
charge: -0.157031 -0.476925 -0.328752 -0.325017 -0.210666 -0.132260 0.508577 -0.188177 -0.171238 -0.145557 -0.371441 -0.289600 -0.305503 -0.284150 0.281182 0.310922 -0.222674 0.400827 0.353164 -0.289170 -0.286437 -0.137645 -0.147925 -0.126577 0.083682 0.086150 0.085571 0.104635 0.100539 0.106169 0.086087 0.086950 0.098063 0.093730 0.102426 0.076075 0.195097 0.144248 0.145080 0.162990 0.128300 0.110289 0.136118 0.115250 0.122932 0.115064 0.172844 0.083784
qa: -0.1570 -0.4769 -0.3288 -0.3250 -0.2107 -0.1323 0.5086 -0.1882 -0.1712 -0.1456 -0.3714 -0.2896 -0.3055 -0.2841 0.2812 0.3109 -0.2227 0.4008 0.3532 -0.2892 -0.2864 -0.1376 -0.1479 -0.1266 0.0837 0.0861 0.0856 0.1046 0.1005 0.1062 0.0861 0.0870 0.0981 0.0937 0.1024 0.0761 0.1951 0.1442 0.1451 0.1630 0.1283 0.1103 0.1361 0.1152 0.1229 0.1151 0.1728 0.0838
va: 2.2101 2.0286 2.0616 2.0781 2.8016 3.1945 3.4355 3.8536 3.8435 4.1792 3.9432 3.9467 3.9704 3.9164 4.0647 4.2705 3.5041 3.7688 3.8837 3.9370 3.9177 3.9352 3.8588 3.8692 1.0062 1.0068 1.0080 1.0045 1.0045 1.0009 1.0000 0.9983 1.0032 1.0001 1.0024 0.9822 1.0048 1.0083 1.0082 0.9893 0.9909 0.9778 0.9885 0.9856 0.9936 0.9861 0.9955 1.0074
dispcorr: -0.025614012 hartree
energy: -1110.868855086431
dipole: 29.74334 -28.01545 1.72790 -8.20291 6.69949 -1.50343 -4.25359 4.32475 0.07117
magnitude: 2.29150 au
magnitude: 5.82454 debye
