program: Orca
programVersion: 5.0.2
elementType: O O O O N N C C C C C C C C C C C C C C C C C C H H H H H H H H H H H H H H H H H H H H H H H H
charge: 0
multiplicity: 1
keywords: wb97x-d3
keywords: def2-TZVPP
keywords: def2/J RIJCOSX
keywords: DEFGRID2
keywords: scfconv7
keywords: smallprint printgap noloewdin
keywords: NOSOSCF
formula: C18H24N2O4
InChI: InChI=1/C18H24N2O4/c1-6-18(3,7-2)14-11-15(24-20-14)19-17(21)16-12(22-4)9-8-10-13(16)23-5/h8-11,19H,6-7H2,1-5H3
48 atoms
O  0.496537 -0.348298 0.585337
O  -2.959985 1.58935 1.741815
O  -2.821265 -1.252719 2.489717
O  -1.71273 0.790352 -1.51999
N  1.727254 -0.635839 0.036991
N  -0.789482 1.492474 1.207956
C  3.680541 0.610793 -0.77746
C  3.596537 1.42994 -2.082338
C  4.575264 1.388956 0.210229
C  2.304215 0.508588 -0.187906
C  4.279101 -0.766619 -1.054651
C  2.697459 0.855197 -3.165991
C  4.702555 0.785479 1.600507
C  1.462086 1.589182 0.185446
C  0.351676 0.972658 0.651377
C  -2.060618 0.993712 1.178337
C  -2.298339 -0.281055 0.448538
C  -2.72987 -1.403759 1.156812
C  -2.143198 -0.342721 -0.936819
C  -3.006214 -2.58881 0.480376
C  -2.426832 -1.520441 -1.620921
C  -2.852989 -2.623091 -0.896695
C  -3.216202 -2.36479 3.27606
C  -1.436878 0.77584 -2.910863
H  3.260158 2.442193 -1.839579
H  4.614076 1.535814 -2.469671
H  5.567027 1.473993 -0.243094
H  3.684753 -1.344862 -1.761448
H  4.376902 -1.366612 -0.150303
H  5.277097 -0.648663 -1.480785
H  3.02478 -0.130347 -3.497812
H  1.660815 0.766884 -2.835053
H  2.699838 1.505387 -4.041149
H  5.350981 1.404438 2.22124
H  3.739075 0.720201 2.108611
H  5.135954 -0.214627 1.581057
H  -0.692325 2.422673 1.598242
H  -3.333498 -3.475962 1.003451
H  -2.322154 -1.591688 -2.694082
H  -3.072368 -3.542002 -1.424192
H  -2.511758 -3.194377 3.187403
H  -4.217243 -2.713055 3.013544
H  -3.225355 -2.020792 4.307305
H  -0.679529 0.031744 -3.165445
H  -2.337353 0.587572 -3.499298
H  -1.057836 1.764198 -3.157729
H  1.648355 2.646341 0.105859
H  4.195623 2.411193 0.298241
elementType: O N C H
totalener: -1110.84358395 hartree
nucrepener: 2205.17991855 hartree
electener: -3316.02350250 hartree
oneelecener: -5896.25365669 hartree
twoeener: 2580.23015419 hartree
cpcmener: -0.04744030 hartree
kineticenergy: 1106.03596908 hartree
xcener: -106.820857385771 hartree
chargesum: 0.0000000
charge: -0.157217 -0.475223 -0.324802 -0.330293 -0.224495 -0.129904 0.506763 -0.186015 -0.182846 -0.145765 -0.373065 -0.274901 -0.291321 -0.281846 0.289560 0.308093 -0.177915 0.337004 0.375100 -0.286567 -0.285795 -0.138515 -0.127675 -0.148469 0.083080 0.086185 0.086283 0.102619 0.103042 0.106283 0.088326 0.061982 0.099427 0.098089 0.086812 0.086110 0.193523 0.144640 0.145121 0.162951 0.115870 0.114984 0.122987 0.117064 0.135864 0.127595 0.174383 0.082890
qa: -0.1572 -0.4752 -0.3248 -0.3303 -0.2245 -0.1299 0.5068 -0.1860 -0.1828 -0.1458 -0.3731 -0.2749 -0.2913 -0.2818 0.2896 0.3081 -0.1779 0.3370 0.3751 -0.2866 -0.2858 -0.1385 -0.1277 -0.1485 0.0831 0.0862 0.0863 0.1026 0.1030 0.1063 0.0883 0.0620 0.0994 0.0981 0.0868 0.0861 0.1935 0.1446 0.1451 0.1630 0.1159 0.1150 0.1230 0.1171 0.1359 0.1276 0.1744 0.0829
va: 2.2034 2.0278 2.0775 2.0621 2.7994 3.2098 3.4333 3.8614 3.8535 4.2032 3.9439 3.9653 3.9511 3.9228 4.0644 4.2714 3.5004 3.9095 3.7967 3.9198 3.9394 3.9354 3.8697 3.8548 1.0064 1.0070 1.0070 1.0042 1.0049 1.0012 1.0002 0.9910 1.0044 1.0031 0.9981 0.9999 1.0061 1.0082 1.0069 0.9892 0.9864 0.9849 0.9937 0.9801 0.9860 0.9920 0.9950 1.0067
dispcorr: -0.025334039 hartree
energy: -1110.868917992353
dipole: 28.91924 -27.42102 1.49822 -0.49013 0.59272 0.10259 -12.24699 10.81740 -1.42959
magnitude: 2.07338 au
magnitude: 5.27011 debye
