program: Gaussian 09
title: 000055346
version: EM64L-G09RevD.01
frameworkgroup: C1[X(C18H27NO2)]
method: RPBEPBE
basis: SDD
operation: Freq
keyword: #p
keyword: freq=noraman
keyword: PBEPBE/SDD
title: #p freq=noraman PBEPBE/SDD
converged: YES YES NO NO
title: Mulliken charges:
elementType: O O N C C C C C C C C C C C C C C C C C C H H H H H H H H H H H H H H H H H H H H H H H H H H H
charge: -0.258040 -0.278804 -0.094325 0.010300 -0.160609 -0.615548 -0.423855 0.463072 0.251595 -0.443249 -0.398016 -0.322441 -0.640545 -0.226927 -0.236478 -0.385418 -0.223212 -0.244125 -0.340988 -0.674963 -0.692760 0.260878 0.249140 0.262873 0.243949 0.186751 0.240860 0.246414 0.205322 0.175728 0.223022 0.186175 0.241086 0.203789 0.195376 0.223754 0.222764 0.226076 0.225681 0.226025 0.192604 0.192111 0.229862 0.231974 0.206711 0.211094 0.215884 0.209433
chargesum: 0.00000
title: Mulliken charges with hydrogens summed into heavy atoms:
elementType: O O N C C C C C C C C C C C C C C C C C C
charge: -0.258040 -0.278804 -0.094325 0.010300 0.100269 -0.103536 0.006845 0.463072 0.251595 -0.202390 -0.151602 0.058610 0.009738 -0.003173 -0.013714 0.013748 0.228545 -0.018100 0.043727 -0.006417 -0.056350
polarizability: 2.15032903e+02 -1.20882144e+01 2.14013305e+02 6.95886050e+00 1.52105465e+01 1.80908645e+02
1716.lowfreq: -14.9221 -8.6129 -0.0005 -0.0004 0.0001 5.4659 11.4544 16.3052 23.5862
frequency: 3.0772 15.0487 23.3360 34.5789 45.2954 51.7350 60.5115 70.7453 80.4578 106.0380 117.5330 121.1229 139.8523 172.0676 199.3588 205.1526 225.8550 235.8844 251.9685 264.5092 288.2990 304.3304 328.7891 340.4896 365.6556 376.2853 405.1583 411.5918 438.7044 469.2520 490.8536 523.4078 541.5785 615.6244 633.6640 696.8424 705.2783 733.1634 741.1764 774.4470 792.8133 799.1856 803.8797 822.4590 828.6248 854.6693 866.7982 898.2980 902.2746 922.4932 931.1494 951.0519 976.5266 982.0778 991.0646 994.3782 1007.1406 1014.8262 1025.2256 1034.7168 1044.3673 1067.5554 1076.8543 1081.3547 1083.2309 1102.5866 1104.2854 1112.2567 1113.1370 1136.1416 1140.7426 1158.5560 1170.5610 1184.1478 1195.0637 1215.9366 1238.5220 1248.2883 1262.4192 1278.0989 1281.6590 1288.2776 1295.4689 1300.5789 1313.7616 1343.5621 1352.2312 1360.0753 1373.2908 1375.8475 1388.7280 1399.9114 1405.5551 1431.6683 1433.9491 1449.2953 1461.9062 1463.9781 1466.7952 1468.8597 1473.3539 1473.9809 1476.1082 1479.7626 1482.2973 1486.0241 1487.0786 1489.8362 1589.1116 1601.0720 1614.2303 2825.6508 2844.0007 2858.6529 2961.8293 2972.2224 2976.5163 2994.9273 3002.8790 3006.9322 3016.0235 3031.3921 3043.3868 3058.5267 3065.1961 3068.9272 3071.6842 3088.3169 3091.5238 3096.6597 3107.2450 3110.4811 3118.1510 3123.6964 3136.2362 3145.7093 3161.1471 3204.4531
redmass: 2.3530 2.4320 3.9993 3.4619 2.9900 2.8536 3.7970 3.2265 3.5249 2.7528 2.7673 2.9085 3.4555 2.5097 2.0355 1.7059 1.1553 3.2672 1.4711 3.9988 2.4132 2.6220 2.8845 5.0526 4.2951 2.4934 2.8376 3.6312 2.7027 3.5168 2.8063 3.6583 3.4783 6.4038 5.2368 5.0673 1.7178 1.0860 3.5201 2.1628 1.2128 1.2135 2.4335 3.1872 4.9282 1.2586 2.6198 1.7597 2.1710 1.4750 1.2234 1.7271 1.4045 2.9356 2.8355 1.7867 1.9030 2.8396 2.2209 2.6431 1.9670 1.5654 2.0630 1.7558 1.6152 2.1340 1.5544 2.0633 1.8238 1.4667 1.7612 2.8784 1.0531 1.1182 2.2993 1.8731 1.5156 1.1350 1.3800 1.3599 2.5653 1.1477 1.9002 1.2748 1.3584 1.4995 1.4979 1.4825 1.4240 7.5717 1.2199 1.2749 1.5222 1.2701 1.9833 1.2965 1.0402 1.0769 1.0847 1.0675 1.0569 1.0595 1.0427 1.0719 1.0607 1.7549 1.3084 1.0865 6.2225 9.2808 6.2069 1.0711 1.0663 1.0624 1.0587 1.0371 1.0584 1.0359 1.0980 1.0580 1.0883 1.0716 1.1018 1.0873 1.1066 1.1006 1.0994 1.1007 1.0985 1.0558 1.1023 1.0892 1.0844 1.0874 1.0920 1.0964 1.1016 1.1163
irintensity: 0.1805 0.0802 0.1084 0.5061 0.2062 0.2022 0.1897 0.0824 2.6133 0.6248 0.2784 0.2871 0.9354 0.4729 1.1928 1.6631 0.0180 2.3006 1.0127 2.4470 2.3026 2.9601 0.7939 10.4200 4.2363 0.3661 0.1049 9.2958 2.0020 2.2539 2.5108 8.7336 19.5686 0.3249 7.2039 15.9640 48.6905 8.9938 5.0489 26.7040 0.3060 8.0300 7.5284 8.6100 5.7590 0.2873 23.7167 8.6121 2.1731 0.0331 4.1090 10.6714 0.4520 2.3561 0.1111 0.8640 20.2413 20.7203 22.7212 21.4525 22.1345 23.4025 9.9659 12.3004 10.0763 101.4375 11.5642 6.8137 19.9584 5.6218 19.8605 219.1466 0.0622 1.2714 11.4792 5.1946 0.7961 0.1199 13.1804 16.7638 126.8810 3.1869 12.8305 7.3374 1.8788 2.0456 4.0918 4.6822 5.2567 0.2662 9.8046 17.4884 6.6841 5.1456 3.7943 21.2510 11.8212 5.1499 12.4541 5.8041 3.3272 8.2034 12.1110 16.7853 9.4104 4.5905 18.3011 22.6657 0.6517 148.1124 1.6721 70.5784 54.9238 272.7023 23.1952 29.3673 45.7788 20.7392 4.2374 22.3993 14.5297 29.2671 63.4039 2.3562 9.5830 92.4762 55.8593 31.6109 32.8757 12.1116 40.0279 13.7351 3.1685 0.3387 20.4644 43.3013 21.9858 6.1724
temp: 298.150 k
press: 1.00000 atm
elementType: 8 8 7 6 6 6 6 6 6 6 6 6 6 6 6 6 6 6 6 6 6 1 1 1 1 1 1 1 1 1 1 1 1 1 1 1 1 1 1 1 1 1 1 1 1 1 1 1
symmnumber: 1
zpe: 1079708.1 jmol-1
zpe.correction: 0.411239 hartree
zpe.thermalcorrener: 0.434741 hartree
zpe.thermalcorrenthalpy: 0.435685 hartree
zpe.thermalcorrgfe: 0.352819 hartree
zpe.sumelectzpe: -905.649262 hartree
zpe.sumelectthermal: -905.625760 hartree
zpe.sumelectthermalent: -905.624816 hartree
zpe.sumelectthermalfe: -905.707682 hartree
dipole: 0.8638 1.0669 0.3701
dipole: 1.4218
quadrupole: -119.6967 -129.5388 -120.7558
quadrupole: -2.4740 0.0917 -1.7311
quadrupole: 3.6338 -6.2084 2.5746 -2.4740 0.0917 -1.7311
hfenergy: -906.060501 hartree
pointgroup: C01 [X(C18H27N1O2)]
dipole: 0.330161 -0.4109925 -0.1870039 debye
polarizability: 217.0466354|10.9055032|206.5651345|-1.2108877|20.948399|186.3430828 unknown
InChI: InChI=1S/C18H27NO2/c1-4-6-12-19(3)14-16-13-18(16,17(20)21-5-2)15-10-8-7-9-11-15/h7-11,16H,4-6,12-14H2,1-3H3
charge 0 multiplicity 1
48 atoms
O  -0.937708 1.428873 -1.338279
O  -0.582674 2.964543 0.370816
N  2.213877 1.042992 0.977206
C  -1.051805 0.615365 0.922214
C  0.022927 0.436804 2.043819
C  -1.351427 0.993834 2.392114
C  1.271333 1.308046 2.097691
C  -1.667704 -0.63262 0.336092
C  -0.831177 1.786211 0.001303
C  -3.059095 -0.874021 0.447216
C  -0.861446 -1.576783 -0.348588
C  2.905283 -0.265363 1.097271
C  3.146555 2.172992 0.776493
C  -3.635882 -2.037222 -0.111877
C  -1.433341 -2.739512 -0.907887
C  3.515315 -0.765504 -0.22931
C  -0.675985 2.520712 -2.323754
C  -2.824223 -2.974329 -0.791341
C  4.111563 -2.186713 -0.103105
C  -0.860794 1.909855 -3.709143
C  4.728397 -2.694959 -1.423991
H  0.170811 -0.618559 2.303544
H  -2.050225 0.35506 2.940155
H  -1.420559 2.065395 2.603483
H  0.971974 2.367941 2.035478
H  1.756921 1.156979 3.096674
H  -3.689936 -0.146825 0.972485
H  0.213096 -1.38403 -0.449266
H  2.163116 -1.013414 1.434674
H  3.70549 -0.232857 1.884366
H  3.758671 2.007581 -0.12632
H  3.843435 2.32917 1.63959
H  2.565711 3.099867 0.627309
H  2.723991 -0.753577 -1.005173
H  4.309488 -0.075153 -0.576634
H  -4.713999 -2.211592 -0.018824
H  -0.799644 -3.461048 -1.436493
H  0.350428 2.895583 -2.156731
H  -1.381074 3.348344 -2.125414
H  -3.269144 -3.87768 -1.22409
H  4.884286 -2.192236 0.692915
H  3.318766 -2.888476 0.228841
H  -0.157994 1.073811 -3.865652
H  -1.887675 1.526778 -3.835937
H  -0.673725 2.674973 -4.484928
H  3.970256 -2.724358 -2.22922
H  5.143272 -3.713579 -1.312133
H  5.547474 -2.031503 -1.76046
