program: Orca
programVersion: 5.0.2
elementType: O O O O N N C C C C C C C C C C C C C C C C C C H H H H H H H H H H H H H H H H H H H H H H H H
charge: 0
multiplicity: 1
keywords: wb97x-d3
keywords: def2-TZVPP
keywords: def2/J RIJCOSX
keywords: DEFGRID2
keywords: scfconv7
keywords: smallprint printgap noloewdin
keywords: NOSOSCF
formula: C18H24N2O4
InChI: InChI=1/C18H24N2O4/c1-6-18(3,7-2)14-11-15(24-20-14)19-17(21)16-12(22-4)9-8-10-13(16)23-5/h8-11,19H,6-7H2,1-5H3
48 atoms
O  0.470048 -0.382286 0.410591
O  -2.935631 1.52191 1.817055
O  -2.912318 -1.330302 2.455702
O  -1.69234 0.803608 -1.476533
N  1.696358 -0.61895 -0.177777
N  -0.767533 1.390118 1.292308
C  3.693525 0.682215 -0.775342
C  3.676747 1.816416 -1.820146
C  4.636894 1.111996 0.368046
C  2.31102 0.528055 -0.211272
C  4.19118 -0.611572 -1.416605
C  2.717609 1.627786 -2.985678
C  4.779042 0.120743 1.51285
C  1.504234 1.560885 0.334703
C  0.367512 0.913737 0.685639
C  -2.051022 0.925144 1.231229
C  -2.324014 -0.312728 0.452941
C  -2.799964 -1.443048 1.120964
C  -2.15425 -0.336285 -0.932394
C  -3.09408 -2.600549 0.404993
C  -2.453627 -1.487472 -1.654007
C  -2.917397 -2.599834 -0.96918
C  -3.331029 -2.460412 3.203264
C  -1.325454 0.80292 -2.846822
H  3.444348 2.758392 -1.314476
H  4.696377 1.924041 -2.201778
H  5.620342 1.302357 -0.07225
H  3.566713 -0.92664 -2.251841
H  4.228871 -1.441123 -0.712021
H  5.201897 -0.458938 -1.799643
H  2.945912 0.736822 -3.570981
H  1.679805 1.550463 -2.65533
H  2.776358 2.480705 -3.662837
H  5.199451 -0.830639 1.186707
H  5.447488 0.520938 2.276351
H  3.823747 -0.086215 1.998502
H  -0.657708 2.293043 1.740184
H  -3.452481 -3.493187 0.896837
H  -2.333788 -1.530669 -2.726994
H  -3.149668 -3.497741 -1.526194
H  -4.334598 -2.785339 2.920858
H  -3.344664 -2.147591 4.24414
H  -2.638038 -3.297347 3.094866
H  -0.554772 0.05815 -3.056239
H  -2.185002 0.624388 -3.496009
H  -0.929378 1.793034 -3.056909
H  1.725005 2.610541 0.427908
H  4.291737 2.071439 0.764304
elementType: O N C H
totalener: -1110.84322341 hartree
nucrepener: 2202.91777505 hartree
electener: -3313.76099846 hartree
oneelecener: -5891.70096977 hartree
twoeener: 2577.93997131 hartree
cpcmener: -0.04707015 hartree
kineticenergy: 1106.02236275 hartree
xcener: -106.818519793364 hartree
chargesum: 0.0000000
charge: -0.155797 -0.475793 -0.324441 -0.332671 -0.232439 -0.131424 0.507882 -0.193234 -0.177781 -0.141461 -0.375033 -0.266545 -0.299630 -0.269535 0.282460 0.308728 -0.142488 0.322758 0.338842 -0.281761 -0.268766 -0.143778 -0.126987 -0.142363 0.084097 0.085736 0.085492 0.105884 0.099189 0.107151 0.087504 0.058592 0.099315 0.087059 0.098844 0.087075 0.192548 0.144785 0.145215 0.162899 0.114747 0.122801 0.116222 0.116299 0.133624 0.127750 0.175372 0.083056
qa: -0.1558 -0.4758 -0.3244 -0.3327 -0.2324 -0.1314 0.5079 -0.1932 -0.1778 -0.1415 -0.3750 -0.2665 -0.2996 -0.2695 0.2825 0.3087 -0.1425 0.3228 0.3388 -0.2818 -0.2688 -0.1438 -0.1270 -0.1424 0.0841 0.0857 0.0855 0.1059 0.0992 0.1072 0.0875 0.0586 0.0993 0.0871 0.0988 0.0871 0.1925 0.1448 0.1452 0.1629 0.1147 0.1228 0.1162 0.1163 0.1336 0.1278 0.1754 0.0831
va: 2.1998 2.0263 2.0790 2.0610 2.7903 3.2172 3.4330 3.8644 3.8472 4.2082 3.9456 3.9508 3.9578 3.9078 4.0780 4.2714 3.4870 3.9316 3.8244 3.9107 3.9268 3.9413 3.8689 3.8507 1.0058 1.0074 1.0062 1.0042 1.0052 1.0006 1.0003 1.0017 1.0053 0.9978 1.0036 0.9986 1.0069 1.0080 1.0058 0.9893 0.9846 0.9938 0.9865 0.9874 0.9861 0.9904 0.9934 1.0073
dispcorr: -0.025357422 hartree
energy: -1110.868580832386
dipole: 29.29290 -27.74285 1.55005 0.25011 -0.16266 0.08745 -11.90360 10.71997 -1.18364
magnitude: 1.95225 au
magnitude: 4.96223 debye
