program: Orca
programVersion: 5.0.2
elementType: O O O O N N C C C C C C C C C C C C C C C C C C H H H H H H H H H H H H H H H H H H H H H H H H
charge: 0
multiplicity: 1
keywords: wb97x-d3
keywords: def2-TZVPP
keywords: def2/J RIJCOSX
keywords: DEFGRID2
keywords: scfconv7
keywords: smallprint printgap noloewdin
keywords: NOSOSCF
formula: C18H24N2O4
InChI: InChI=1/C18H24N2O4/c1-6-18(3,7-2)14-11-15(24-20-14)19-17(21)16-12(22-4)9-8-10-13(16)23-5/h8-11,19H,6-7H2,1-5H3
48 atoms
O  0.939809 2.135069 1.376647
O  -3.207426 0.668104 2.197338
O  -2.582717 -2.122496 1.354169
O  -1.701325 1.893129 -0.772894
N  2.121295 1.89236 0.722395
N  -1.018564 1.106321 1.993082
C  3.219089 0.004581 -0.405421
C  3.844269 -1.012899 0.578178
C  2.652074 -0.72961 -1.635641
C  2.078551 0.651202 0.332515
C  4.255529 1.04637 -0.825854
C  5.064774 -1.766616 0.070135
C  1.925509 0.153798 -2.639456
C  0.870031 0.026999 0.744589
C  0.206485 1.021019 1.378018
C  -2.190135 0.561782 1.545535
C  -2.152214 -0.141824 0.230725
C  -2.402538 -1.51368 0.172459
C  -1.924851 0.580706 -0.941841
C  -2.413922 -2.16631 -1.058475
C  -1.937448 -0.064656 -2.174951
C  -2.181905 -1.428724 -2.208421
C  -2.83899 -3.514425 1.374997
C  -1.430753 2.697055 -1.906149
H  4.116865 -0.480344 1.494163
H  3.07669 -1.73744 0.86614
H  3.474543 -1.237983 -2.14468
H  3.811102 1.865029 -1.391796
H  5.016945 0.591061 -1.460082
H  4.761424 1.484129 0.036102
H  4.848505 -2.365616 -0.815232
H  5.89278 -1.099496 -0.171817
H  5.422093 -2.45207 0.84018
H  1.104939 0.709992 -2.181887
H  2.593477 0.877478 -3.108488
H  1.495227 -0.453397 -3.437419
H  -1.086258 1.697166 2.814181
H  -2.595484 -3.229052 -1.134956
H  -1.765931 0.471023 -3.097819
H  -2.19284 -1.934965 -3.165086
H  -2.956813 -3.787437 2.421283
H  -2.010164 -4.089266 0.95469
H  -3.7589 -3.767966 0.842439
H  -0.533291 2.367983 -2.434942
H  -2.272892 2.715823 -2.601895
H  -1.264059 3.704506 -1.531711
H  0.559793 -0.992406 0.594638
H  1.975465 -1.519986 -1.296481
elementType: O N C H
totalener: -1110.84870389 hartree
nucrepener: 2235.26452330 hartree
electener: -3346.11322719 hartree
oneelecener: -5955.26453228 hartree
twoeener: 2609.15130510 hartree
cpcmener: -0.03655464 hartree
kineticenergy: 1106.02471658 hartree
xcener: -106.818240050205 hartree
chargesum: -0.0000000
charge: -0.160338 -0.440780 -0.312144 -0.317633 -0.201676 -0.140289 0.496259 -0.176405 -0.190863 -0.106162 -0.386009 -0.295338 -0.269667 -0.265579 0.255246 0.299522 -0.234952 0.349031 0.439097 -0.289892 -0.350095 -0.104204 -0.132264 -0.135835 0.089397 0.084563 0.085372 0.105262 0.102618 0.105829 0.084803 0.086620 0.097715 0.041323 0.098582 0.098696 0.183148 0.140580 0.141330 0.158922 0.122344 0.112355 0.114526 0.111445 0.123489 0.125975 0.174681 0.081394
qa: -0.1603 -0.4408 -0.3121 -0.3176 -0.2017 -0.1403 0.4963 -0.1764 -0.1909 -0.1062 -0.3860 -0.2953 -0.2697 -0.2656 0.2552 0.2995 -0.2350 0.3490 0.4391 -0.2899 -0.3501 -0.1042 -0.1323 -0.1358 0.0894 0.0846 0.0854 0.1053 0.1026 0.1058 0.0848 0.0866 0.0977 0.0413 0.0986 0.0987 0.1831 0.1406 0.1413 0.1589 0.1223 0.1124 0.1145 0.1114 0.1235 0.1260 0.1747 0.0814
va: 2.2046 2.0742 2.0826 2.0809 2.8271 3.1784 3.4746 3.8521 3.8799 4.0424 3.9532 3.9382 3.9664 3.8926 4.0731 4.2881 3.4853 3.8720 3.6989 3.9307 3.9261 3.9142 3.8771 3.8690 1.0114 1.0058 1.0060 1.0032 0.9947 1.0064 0.9985 0.9970 1.0030 0.9893 1.0021 1.0044 1.0163 1.0091 1.0093 0.9896 0.9940 0.9856 0.9855 0.9767 0.9872 0.9937 0.9831 1.0082
dispcorr: -0.027156745 hartree
energy: -1110.875860637084
dipole: 26.29402 -25.40305 0.89097 -12.04402 10.04645 -1.99758 -17.63125 15.72535 -1.90590
magnitude: 2.90114 au
magnitude: 7.37412 debye
