program: Orca
programVersion: 5.0.2
elementType: O O O O N N C C C C C C C C C C C C C C C C C C H H H H H H H H H H H H H H H H H H H H H H H H
charge: 0
multiplicity: 1
keywords: wb97x-d3
keywords: def2-TZVPP
keywords: def2/J RIJCOSX
keywords: DEFGRID2
keywords: scfconv7
keywords: smallprint printgap noloewdin
keywords: NOSOSCF
formula: C18H24N2O4
InChI: InChI=1/C18H24N2O4/c1-6-18(3,7-2)14-11-15(24-20-14)19-17(21)16-12(22-4)9-8-10-13(16)23-5/h8-11,19H,6-7H2,1-5H3
48 atoms
O  1.010543 2.323617 0.970667
O  -3.16431 1.048454 1.994212
O  -2.302095 -1.817132 2.150598
O  -1.954495 1.233397 -1.309429
N  2.198751 2.004189 0.360429
N  -1.010198 1.467576 1.552872
C  3.210405 0.088856 -0.767804
C  3.467059 0.865199 -2.076826
C  4.50193 0.135694 0.073038
C  2.090016 0.760819 -0.013622
C  2.839745 -1.358656 -1.085416
C  2.265457 1.03089 -2.995768
C  4.435604 -0.555522 1.426447
C  0.835905 0.216409 0.361316
C  0.210063 1.261387 0.963028
C  -2.168115 0.764989 1.363572
C  -2.139591 -0.344751 0.371224
C  -2.241824 -1.661899 0.819696
C  -2.05408 -0.066931 -0.99322
C  -2.242343 -2.708726 -0.099374
C  -2.06073 -1.108024 -1.916981
C  -2.152654 -2.410287 -1.449781
C  -2.409627 -3.124397 2.683665
C  -1.833691 1.596449 -2.672747
H  3.858367 1.854479 -1.824075
H  4.267537 0.349676 -2.616339
H  5.303024 -0.31296 -0.522479
H  2.656152 -1.947289 -0.185819
H  3.655598 -1.838298 -1.629523
H  1.945015 -1.431868 -1.704871
H  2.550818 1.586735 -3.890214
H  1.859633 0.074935 -3.329389
H  1.458065 1.588252 -2.516895
H  5.375514 -0.422162 1.963977
H  3.644739 -0.146619 2.05813
H  4.26861 -1.629544 1.337931
H  -1.081706 2.268088 2.172261
H  -2.310428 -3.740307 0.216104
H  -1.995944 -0.925031 -2.980184
H  -2.154611 -3.222773 -2.165019
H  -2.465336 -3.009682 3.763822
H  -1.537721 -3.736882 2.441321
H  -3.313518 -3.631789 2.338587
H  -0.948007 1.155923 -3.136845
H  -2.718822 1.312969 -3.247326
H  -1.736113 2.679389 -2.693349
H  0.482867 -0.787436 0.21182
H  4.782996 1.182019 0.220071
elementType: O N C H
totalener: -1110.84899489 hartree
nucrepener: 2227.82647695 hartree
electener: -3338.67547184 hartree
oneelecener: -5940.31608692 hartree
twoeener: 2601.64061508 hartree
cpcmener: -0.03488884 hartree
kineticenergy: 1106.02215611 hartree
xcener: -106.817819391520 hartree
chargesum: 0.0000000
charge: -0.167607 -0.436651 -0.311052 -0.318324 -0.201697 -0.130784 0.501864 -0.170923 -0.179834 -0.190172 -0.410473 -0.289296 -0.289986 -0.232176 0.310806 0.290345 -0.216375 0.369488 0.379671 -0.289539 -0.292158 -0.126725 -0.134266 -0.136268 0.081762 0.079576 0.081263 0.109550 0.108947 0.102627 0.101165 0.084747 0.079880 0.097651 0.087905 0.084075 0.181902 0.141492 0.140690 0.159070 0.122517 0.113810 0.114358 0.101427 0.128543 0.126949 0.160710 0.081513
qa: -0.1676 -0.4367 -0.3111 -0.3183 -0.2017 -0.1308 0.5019 -0.1709 -0.1798 -0.1902 -0.4105 -0.2893 -0.2900 -0.2322 0.3108 0.2903 -0.2164 0.3695 0.3797 -0.2895 -0.2922 -0.1267 -0.1343 -0.1363 0.0818 0.0796 0.0813 0.1095 0.1089 0.1026 0.1012 0.0847 0.0799 0.0977 0.0879 0.0841 0.1819 0.1415 0.1407 0.1591 0.1225 0.1138 0.1144 0.1014 0.1285 0.1269 0.1607 0.0815
va: 2.2243 2.0749 2.0903 2.0720 2.8244 3.1921 3.4552 3.8638 3.8546 4.1206 3.9593 3.9488 3.9430 3.7532 4.0727 4.2849 3.4790 3.8631 3.7805 3.9305 3.9369 3.9358 3.8777 3.8677 1.0153 1.0103 1.0084 0.9953 1.0038 0.9994 1.0053 0.9980 0.9961 1.0037 0.9995 0.9981 1.0196 1.0094 1.0085 0.9902 0.9940 0.9855 0.9850 0.9834 0.9883 0.9930 0.9872 1.0171
dispcorr: -0.026370156 hartree
energy: -1110.875365041896
dipole: 24.51151 -23.83107 0.68044 -11.94482 9.58743 -2.35739 -14.65714 13.01441 -1.64273
magnitude: 2.95277 au
magnitude: 7.50534 debye
