program: Orca
programVersion: 5.0.2
elementType: O O O O N N C C C C C C C C C C C C C C C C C C H H H H H H H H H H H H H H H H H H H H H H H H
charge: 0
multiplicity: 1
keywords: wb97x-d3
keywords: def2-TZVPP
keywords: def2/J RIJCOSX
keywords: DEFGRID2
keywords: scfconv7
keywords: smallprint printgap noloewdin
keywords: NOSOSCF
formula: C18H24N2O4
InChI: InChI=1/C18H24N2O4/c1-6-18(3,7-2)14-11-15(24-20-14)19-17(21)16-12(22-4)9-8-10-13(16)23-5/h8-11,19H,6-7H2,1-5H3
48 atoms
O  1.780223 -0.931064 -1.2877
O  -1.080344 0.754246 1.124413
O  -2.71717 -1.481446 2.103832
O  -2.593895 0.338232 -2.222746
N  3.078935 -0.506654 -1.118017
N  -0.331781 -0.618207 -0.509094
C  4.286315 1.096231 0.292891
C  4.091201 2.609551 0.062113
C  4.448815 0.867494 1.809665
C  3.047707 0.383867 -0.171261
C  5.525041 0.60371 -0.453046
C  3.863363 3.030837 -1.381498
C  4.557753 -0.58399 2.250922
C  1.726956 0.577456 0.319355
C  0.993315 -0.28088 -0.433133
C  -1.310699 -0.06671 0.2619
C  -2.685721 -0.567555 -0.031425
C  -3.388155 -1.259003 0.965538
C  -3.294781 -0.313325 -1.256256
C  -4.689759 -1.684408 0.721774
C  -4.598264 -0.728365 -1.499031
C  -5.277127 -1.413587 -0.507006
C  -3.373288 -2.149777 3.165726
C  -2.766538 1.750215 -2.233215
H  3.249894 2.952148 0.672061
H  4.975239 3.121351 0.454604
H  5.340114 1.413976 2.132448
H  5.712441 -0.457603 -0.290471
H  6.403029 1.151741 -0.104576
H  5.449041 0.752763 -1.529826
H  4.724238 2.818068 -2.015919
H  2.995599 2.536088 -1.822107
H  3.6820 4.105483 -1.437262
H  3.679496 -1.166453 1.966437
H  5.434802 -1.080514 1.834622
H  4.641913 -0.642254 3.337257
H  -0.591891 -1.311201 -1.200298
H  -5.252088 -2.228631 1.467584
H  -5.062814 -0.52511 -2.455235
H  -6.289567 -1.75045 -0.688313
H  -3.663641 -3.166794 2.891082
H  -4.255747 -1.602955 3.506776
H  -2.656844 -2.200295 3.982429
H  -3.811176 2.02685 -2.396104
H  -2.424113 2.20867 -1.301767
H  -2.168342 2.138395 -3.05537
H  1.403057 1.246099 1.094537
H  3.60628 1.335112 2.327886
elementType: O N C H
totalener: -1110.84993508 hartree
nucrepener: 2108.23611607 hartree
electener: -3219.08605115 hartree
oneelecener: -5701.77346750 hartree
twoeener: 2482.68741635 hartree
cpcmener: -0.03283901 hartree
kineticenergy: 1106.02058517 hartree
xcener: -106.810828692705 hartree
chargesum: -0.0000000
charge: -0.176701 -0.454807 -0.308683 -0.375490 -0.192515 -0.132417 0.499431 -0.176842 -0.180710 -0.211481 -0.371398 -0.292611 -0.288126 -0.270471 0.304226 0.377106 -0.107052 0.284062 0.238607 -0.255153 -0.229046 -0.122878 -0.133650 -0.102908 0.082364 0.084153 0.084601 0.104186 0.104615 0.101539 0.085473 0.088125 0.097209 0.087666 0.085232 0.096885 0.193902 0.142062 0.146952 0.159048 0.113392 0.115218 0.122824 0.105978 0.103797 0.124146 0.168464 0.081672
qa: -0.1767 -0.4548 -0.3087 -0.3755 -0.1925 -0.1324 0.4994 -0.1768 -0.1807 -0.2115 -0.3714 -0.2926 -0.2881 -0.2705 0.3042 0.3771 -0.1071 0.2841 0.2386 -0.2552 -0.2290 -0.1229 -0.1336 -0.1029 0.0824 0.0842 0.0846 0.1042 0.1046 0.1015 0.0855 0.0881 0.0972 0.0877 0.0852 0.0969 0.1939 0.1421 0.1470 0.1590 0.1134 0.1152 0.1228 0.1060 0.1038 0.1241 0.1685 0.0817
va: 2.2068 2.0482 2.1024 1.9687 2.8035 3.2482 3.4424 3.8515 3.8546 4.2611 3.9448 3.9565 3.9517 3.9291 4.0774 4.0777 3.5924 3.8872 3.8562 3.8981 4.0333 3.9142 3.8762 3.8444 1.0074 1.0073 1.0075 1.0051 1.0007 1.0054 0.9990 0.9973 1.0033 0.9977 1.0000 1.0033 1.0064 1.0092 1.0029 0.9894 0.9851 0.9853 0.9940 0.9905 0.9927 0.9935 1.0108 1.0074
dispcorr: -0.022962513 hartree
energy: -1110.872897592126
dipole: 23.24888 -25.26914 -2.02026 11.10541 -11.33179 -0.22638 6.71464 -6.16874 0.54590
magnitude: 2.10492 au
magnitude: 5.35029 debye
