program: Orca
programVersion: 5.0.2
elementType: O O O O N N C C C C C C C C C C C C C C C C C C H H H H H H H H H H H H H H H H H H H H H H H H
charge: 0
multiplicity: 1
keywords: wb97x-d3
keywords: def2-TZVPP
keywords: def2/J RIJCOSX
keywords: DEFGRID2
keywords: scfconv7
keywords: smallprint printgap noloewdin
keywords: NOSOSCF
formula: C18H24N2O4
InChI: InChI=1/C18H24N2O4/c1-6-18(3,7-2)14-11-15(24-20-14)19-17(21)16-12(22-4)9-8-10-13(16)23-5/h8-11,19H,6-7H2,1-5H3
48 atoms
O  0.928705 2.101848 1.149513
O  -3.091369 0.524557 2.271469
O  -2.565283 -2.205499 1.279077
O  -1.65844 1.873841 -0.716058
N  2.079345 1.873892 0.442346
N  -0.919559 1.00265 1.979572
C  3.228302 -0.033148 -0.596031
C  3.955982 -1.010263 0.353346
C  2.644412 -0.859581 -1.759665
C  2.096725 0.602486 0.160736
C  4.201767 1.01711 -1.127576
C  4.552668 -0.393636 1.609661
C  1.841399 -0.076185 -2.787248
C  0.958569 -0.053648 0.703435
C  0.272735 0.948656 1.296278
C  -2.106033 0.463065 1.566519
C  -2.119948 -0.188515 0.224029
C  -2.400419 -1.552499 0.119038
C  -1.906409 0.572285 -0.927388
C  -2.454458 -2.156338 -1.135438
C  -1.958451 -0.025008 -2.183298
C  -2.231753 -1.381497 -2.262544
C  -2.859034 -3.58981 1.250015
C  -1.285134 2.692586 -1.808577
H  3.257143 -1.801763 0.64179
H  4.747383 -1.502184 -0.220555
H  3.476308 -1.366639 -2.257714
H  5.006779 0.526509 -1.678355
H  4.656901 1.604299 -0.330558
H  3.718628 1.721011 -1.805274
H  3.79682 0.094419 2.227931
H  5.017906 -1.166459 2.223157
H  5.323905 0.344006 1.384267
H  2.4568 0.633046 -3.341906
H  1.39324 -0.753556 -3.515882
H  1.025143 0.483539 -2.327289
H  -0.949425 1.551652 2.831878
H  -2.660584 -3.211424 -1.247291
H  -1.795429 0.542893 -3.088271
H  -2.274351 -1.851279 -3.236771
H  -2.054158 -4.169817 0.791917
H  -3.795093 -3.797364 0.725745
H  -2.965613 -3.900875 2.286875
H  -2.090458 2.788104 -2.540758
H  -1.072542 3.675368 -1.394066
H  -0.386804 2.320543 -2.306519
H  0.703004 -1.09861 0.662256
H  2.015918 -1.653997 -1.345951
elementType: O N C H
totalener: -1110.84951775 hartree
nucrepener: 2248.77361273 hartree
electener: -3359.62313049 hartree
oneelecener: -5982.37036967 hartree
twoeener: 2622.74723918 hartree
cpcmener: -0.03669822 hartree
kineticenergy: 1106.02356491 hartree
xcener: -106.817716346171 hartree
chargesum: 0.0000000
charge: -0.158501 -0.442540 -0.312554 -0.317744 -0.181595 -0.141497 0.498607 -0.168726 -0.179378 -0.175514 -0.375595 -0.296252 -0.259286 -0.236681 0.257530 0.296135 -0.203623 0.342576 0.407368 -0.286105 -0.340477 -0.108726 -0.131660 -0.140657 0.080985 0.084764 0.085318 0.104953 0.102044 0.106916 0.088072 0.097738 0.086182 0.097206 0.098712 0.031241 0.183599 0.140435 0.143277 0.158941 0.112293 0.114378 0.122351 0.124362 0.126775 0.115028 0.168432 0.080893
qa: -0.1585 -0.4425 -0.3126 -0.3177 -0.1816 -0.1415 0.4986 -0.1687 -0.1794 -0.1755 -0.3756 -0.2963 -0.2593 -0.2367 0.2575 0.2961 -0.2036 0.3426 0.4074 -0.2861 -0.3405 -0.1087 -0.1317 -0.1407 0.0810 0.0848 0.0853 0.1050 0.1020 0.1069 0.0881 0.0977 0.0862 0.0972 0.0987 0.0312 0.1836 0.1404 0.1433 0.1589 0.1123 0.1144 0.1224 0.1244 0.1268 0.1150 0.1684 0.0809
va: 2.2124 2.0740 2.0839 2.0798 2.8074 3.1670 3.4610 3.8451 3.8559 4.1367 3.9435 3.9606 3.9548 3.8858 4.0590 4.2959 3.4879 3.8723 3.7228 3.9216 3.9096 3.9140 3.8765 3.8668 1.0073 1.0069 1.0087 1.0006 1.0063 1.0023 0.9978 1.0034 0.9988 1.0032 1.0061 0.9921 1.0147 1.0091 1.0078 0.9898 0.9856 0.9856 0.9940 0.9874 0.9938 0.9757 0.9897 1.0090
dispcorr: -0.027728111 hartree
energy: -1110.877245865201
dipole: 25.22595 -24.21323 1.01272 -9.76935 7.79917 -1.97018 -15.26631 13.42669 -1.83962
magnitude: 2.87948 au
magnitude: 7.31907 debye
