program: Orca
programVersion: 5.0.2
elementType: O O O O N N C C C C C C C C C C C C C C C C C C H H H H H H H H H H H H H H H H H H H H H H H H
charge: 0
multiplicity: 1
keywords: wb97x-d3
keywords: def2-TZVPP
keywords: def2/J RIJCOSX
keywords: DEFGRID2
keywords: scfconv7
keywords: smallprint printgap noloewdin
keywords: NOSOSCF
formula: C18H24N2O4
InChI: InChI=1/C18H24N2O4/c1-6-18(3,7-2)14-11-15(24-20-14)19-17(21)16-12(22-4)9-8-10-13(16)23-5/h8-11,19H,6-7H2,1-5H3
48 atoms
O  1.592363 -1.751418 0.338314
O  -1.012136 1.340848 -0.351422
O  -2.417215 -0.76319 2.222584
O  -3.043303 0.384211 -2.228364
N  2.936629 -1.470938 0.275937
N  -0.458354 -0.813023 0.050745
C  4.380867 0.452758 -0.176983
C  4.335928 1.385876 -1.403129
C  4.686663 1.221612 1.129155
C  3.033582 -0.214051 -0.048871
C  5.468815 -0.607726 -0.362814
C  5.609875 2.171396 -1.67548
C  3.785338 2.398918 1.467023
C  1.749621 0.372875 -0.223226
C  0.901943 -0.655052 0.036045
C  -1.354989 0.202091 -0.113922
C  -2.78425 -0.210068 -0.000398
C  -3.298875 -0.673317 1.2141
C  -3.627392 -0.057877 -1.106086
C  -4.65049 -0.992632 1.32381
C  -4.977655 -0.382262 -1.001501
C  -5.463284 -0.841021 0.212307
C  -2.864482 -1.222747 3.485068
C  -3.830588 0.544086 -3.393964
H  4.095632 0.781456 -2.283184
H  3.511806 2.095243 -1.297794
H  4.665408 0.503657 1.954447
H  5.493706 -1.311159 0.469813
H  6.452077 -0.139942 -0.417075
H  5.322096 -1.181004 -1.28015
H  5.878369 2.827956 -0.846579
H  6.464928 1.525901 -1.877479
H  5.473694 2.804657 -2.553343
H  4.111989 2.86018 2.400523
H  3.811757 3.175105 0.700423
H  2.744942 2.102742 1.605069
H  -0.810267 -1.743566 0.238182
H  -5.075999 -1.349138 2.251081
H  -5.650099 -0.283235 -1.84163
H  -6.513792 -1.088396 0.294878
H  -1.993886 -1.218285 4.136898
H  -3.257755 -2.241027 3.432781
H  -3.625055 -0.564623 3.912104
H  -4.625218 1.280521 -3.251923
H  -3.157323 0.904079 -4.168642
H  -4.270093 -0.400673 -3.722988
H  1.514686 1.381497 -0.503676
H  5.720186 1.574688 1.07326
elementType: O N C H
totalener: -1110.85248776 hartree
nucrepener: 2088.46048360 hartree
electener: -3199.31297137 hartree
oneelecener: -5662.45216390 hartree
twoeener: 2463.13919253 hartree
cpcmener: -0.03472082 hartree
kineticenergy: 1106.01458645 hartree
xcener: -106.815732652140 hartree
chargesum: 0.0000000
charge: -0.170436 -0.457179 -0.323685 -0.308567 -0.228791 -0.144324 0.474998 -0.197955 -0.189443 -0.068676 -0.364504 -0.297524 -0.297712 -0.333279 0.294261 0.388626 -0.206330 0.356243 0.340509 -0.293358 -0.290014 -0.125761 -0.132206 -0.130803 0.091602 0.084969 0.087822 0.099442 0.098513 0.107426 0.084100 0.088278 0.097352 0.099946 0.085053 0.092652 0.192043 0.139959 0.140065 0.158294 0.123137 0.113702 0.115083 0.113768 0.122435 0.112910 0.173223 0.084136
qa: -0.1704 -0.4572 -0.3237 -0.3086 -0.2288 -0.1443 0.4750 -0.1980 -0.1894 -0.0687 -0.3645 -0.2975 -0.2977 -0.3333 0.2943 0.3886 -0.2063 0.3562 0.3405 -0.2934 -0.2900 -0.1258 -0.1322 -0.1308 0.0916 0.0850 0.0878 0.0994 0.0985 0.1074 0.0841 0.0883 0.0974 0.0999 0.0851 0.0927 0.1920 0.1400 0.1401 0.1583 0.1231 0.1137 0.1151 0.1138 0.1224 0.1129 0.1732 0.0841
va: 2.2036 2.0558 2.0795 2.1026 2.8278 3.2402 3.4945 3.8929 3.8783 4.1169 3.9396 3.9317 3.9423 3.9263 4.1141 4.0961 3.5656 3.8461 3.8760 3.9267 3.9256 3.9398 3.8753 3.8752 1.0091 1.0002 1.0127 1.0139 0.9981 1.0061 0.9983 0.9982 1.0032 1.0044 0.9987 0.9942 1.0066 1.0108 1.0104 0.9913 0.9938 0.9858 0.9858 0.9853 0.9942 0.9858 1.0052 0.9963
dispcorr: -0.022049200 hartree
energy: -1110.874536964055
dipole: 24.84677 -27.08164 -2.23487 11.34108 -11.93970 -0.59862 -1.13722 1.26332 0.12610
magnitude: 2.31709 au
magnitude: 5.88957 debye
