program: Orca
programVersion: 5.0.2
elementType: O O O O N N C C C C C C C C C C C C C C C C C C H H H H H H H H H H H H H H H H H H H H H H H H
charge: 0
multiplicity: 1
keywords: wb97x-d3
keywords: def2-TZVPP
keywords: def2/J RIJCOSX
keywords: DEFGRID2
keywords: scfconv7
keywords: smallprint printgap noloewdin
keywords: NOSOSCF
formula: C18H24N2O4
InChI: InChI=1/C18H24N2O4/c1-6-18(3,7-2)14-11-15(24-20-14)19-17(21)16-12(22-4)9-8-10-13(16)23-5/h8-11,19H,6-7H2,1-5H3
48 atoms
O  1.445879 -0.202392 -1.680511
O  -1.043814 0.346192 1.52708
O  -2.763955 -1.997562 1.763022
O  -2.807489 1.326904 -1.468878
N  2.784973 0.046279 -1.493091
N  -0.540131 -0.300908 -0.578953
C  4.271982 0.720359 0.333725
C  5.40591 0.001185 -0.417894
C  4.390698 2.251515 0.139529
C  2.927632 0.335698 -0.232147
C  4.309586 0.37125 1.823323
C  5.410635 -1.516763 -0.30131
C  5.619151 2.905116 0.755775
C  1.684325 0.286249 0.454643
C  0.806872 -0.060822 -0.522176
C  -1.4102 -0.05903 0.444566
C  -2.838085 -0.355016 0.128025
C  -3.508073 -1.336307 0.865956
C  -3.526505 0.385582 -0.837176
C  -4.856529 -1.588823 0.626979
C  -4.876004 0.13745 -1.077444
C  -5.514503 -0.846884 -0.340887
C  -3.381949 -2.969269 2.586094
C  -3.427523 2.103187 -2.477474
H  5.371979 0.28429 -1.473237
H  6.357414 0.378683 -0.035859
H  4.369588 2.465103 -0.933366
H  5.313739 0.506375 2.226905
H  4.021192 -0.66393 2.008731
H  3.637376 1.007379 2.402208
H  5.57034 -1.849935 0.725021
H  4.480567 -1.962887 -0.655042
H  6.218483 -1.93795 -0.901962
H  5.650356 2.788301 1.839639
H  6.551661 2.511785 0.350032
H  5.609309 3.97675 0.550386
H  -0.908789 -0.646592 -1.45618
H  -5.396225 -2.348388 1.174568
H  -5.43264 0.696295 -1.816264
H  -6.562897 -1.042115 -0.526416
H  -4.183817 -2.539655 3.191377
H  -2.606071 -3.343479 3.250076
H  -3.778266 -3.805527 2.004917
H  -3.791282 1.485024 -3.301906
H  -4.253827 2.69923 -2.082796
H  -2.662181 2.775872 -2.857631
H  1.496762 0.466383 1.496142
H  3.497171 2.723956 0.55957
elementType: O N C H
totalener: -1110.85263910 hartree
nucrepener: 2079.18029043 hartree
electener: -3190.03292953 hartree
oneelecener: -5643.96388596 hartree
twoeener: 2453.93095643 hartree
cpcmener: -0.03440199 hartree
kineticenergy: 1106.01196409 hartree
xcener: -106.814146010215 hartree
chargesum: 0.0000000
charge: -0.171734 -0.455633 -0.307859 -0.322734 -0.228447 -0.146105 0.458946 -0.178040 -0.170854 -0.062669 -0.407272 -0.294216 -0.295220 -0.296689 0.287065 0.386688 -0.202170 0.335298 0.355048 -0.287047 -0.294596 -0.126554 -0.132070 -0.132177 0.077279 0.080712 0.080333 0.104774 0.116121 0.107215 0.084639 0.087068 0.096158 0.085347 0.083973 0.097522 0.192681 0.140304 0.141043 0.158060 0.114161 0.122488 0.113015 0.113952 0.114988 0.122738 0.167500 0.086970
qa: -0.1717 -0.4556 -0.3079 -0.3227 -0.2284 -0.1461 0.4589 -0.1780 -0.1709 -0.0627 -0.4073 -0.2942 -0.2952 -0.2967 0.2871 0.3867 -0.2022 0.3353 0.3550 -0.2870 -0.2946 -0.1266 -0.1321 -0.1322 0.0773 0.0807 0.0803 0.1048 0.1161 0.1072 0.0846 0.0871 0.0962 0.0853 0.0840 0.0975 0.1927 0.1403 0.1410 0.1581 0.1142 0.1225 0.1130 0.1140 0.1150 0.1227 0.1675 0.0870
va: 2.2081 2.0575 2.1021 2.0803 2.7958 3.2384 3.5307 3.8591 3.8721 4.0873 3.9544 3.9490 3.9409 3.9361 4.1006 4.0995 3.5625 3.8789 3.8477 3.9238 3.9247 3.9394 3.8755 3.8748 1.0195 1.0058 1.0151 0.9943 0.9954 0.9999 0.9962 1.0059 1.0036 0.9964 0.9993 1.0034 1.0060 1.0100 1.0105 0.9915 0.9860 0.9941 0.9851 0.9861 0.9856 0.9939 1.0102 1.0042
dispcorr: -0.021764974 hartree
energy: -1110.874404075142
dipole: 27.05195 -29.24835 -2.19640 4.20408 -4.72442 -0.52033 5.20764 -5.65367 -0.44603
magnitude: 2.30084 au
magnitude: 5.84826 debye
