program: Gaussian 09
title: 000006362
version: EM64L-G09RevD.01
frameworkgroup: C1[X(C3H7I)]
method: RPBEPBE
basis: SDD
operation: Freq
keyword: #p
keyword: freq=noraman
keyword: PBEPBE/SDD
title: #p freq=noraman PBEPBE/SDD
converged: NO YES NO NO
title: Mulliken charges:
elementType: I C C C H H H H H H H
charge: -0.016910 -0.448778 -0.612579 -0.612574 0.285803 0.245464 0.217513 0.239543 0.245462 0.217514 0.239540
chargesum: 0.00000
title: Mulliken charges with hydrogens summed into heavy atoms:
elementType: I C C C
charge: -0.016910 -0.162975 0.089942 0.089943
polarizability: 8.26557561e+01 3.35559417e-03 4.20698888e+01 4.61910658e+00 1.13471431e-04 3.48155495e+01
1716.lowfreq: -25.6113 -15.3328 -14.8201 0.0002 0.0003 0.0004 229.8098 238.5467 249.7763
frequency: 229.7871 238.5467 249.7734 271.0893 383.5308 467.7410 878.1598 925.7898 940.7810 1021.3364 1136.3637 1148.1954 1211.6331 1318.6989 1381.2684 1397.2389 1451.7530 1464.3616 1465.7388 1482.1694 2966.2611 2971.0921 3056.8532 3065.3537 3074.6348 3102.5230 3110.3629
redmass: 1.1013 2.4197 2.4348 1.2164 2.2192 2.8091 2.7585 1.1511 1.3704 1.2031 2.3729 1.7816 1.3445 1.4110 1.2153 1.2007 1.0450 1.0485 1.0424 1.0492 1.0408 1.0400 1.0893 1.0927 1.0915 1.1013 1.1003
irintensity: 0.1138 4.2460 0.0144 1.1856 2.6966 18.3750 10.0512 4.2122 0.5138 17.4814 2.1643 84.0851 49.2797 1.7845 23.6142 11.0515 5.0097 3.3176 17.3807 13.0260 11.4651 40.5362 1.3169 9.7485 30.0737 15.2008 36.1377
temp: 298.150 k
press: 1.00000 atm
elementType: 53 6 6 6 1 1 1 1 1 1 1
symmnumber: 1
zpe: 241711.7 jmol-1
zpe.correction: 0.092063 hartree
zpe.thermalcorrener: 0.097728 hartree
zpe.thermalcorrenthalpy: 0.098672 hartree
zpe.thermalcorrgfe: 0.061766 hartree
zpe.sumelectzpe: -129.682994 hartree
zpe.sumelectthermal: -129.677329 hartree
zpe.sumelectthermalent: -129.676385 hartree
zpe.sumelectthermalfe: -129.713291 hartree
dipole: 2.6514 0.0000 0.3033
dipole: 2.6686
quadrupole: -36.6673 -40.7768 -40.9531
quadrupole: 0.0000 1.0938 0.0000
quadrupole: 2.7984 -1.3111 -1.4874 0.0000 1.0938 0.0000
hfenergy: -129.775057 hartree
pointgroup: C01 [X(C3H7I1)]
dipole: -1.0416062 0.0003124 0.1319259 debye
dipolederiv: -0.6223023 0.0001114 0.0076065 0.0001739 -0.1802695 -0.0000068 0.0782347 -0.0000141 -0.1364101 1.109941 -0.0002444 -0.0820717 -0.0002357 0.2091219 0.0000321 -0.1406692 0.0000184 0.1075277 -0.2090715 -0.1166649 -0.0338654 0.0257182 -0.0960289 -0.0431973 0.059209 -0.0038554 0.0351645 -0.2089956 0.1167651 -0.0338372 -0.0255046 -0.0960811 0.0432121 0.0592237 0.0038289 0.0351921 -0.0967258 0.0000321 0.0617263 0.0000036 0.0182252 -0.000014 0.0143708 0.000015 -0.1127432 0.0828356 0.0926706 -0.0423382 0.0460905 -0.08327 0.0599166 -0.0414917 0.0762489 0.0667751 -0.1848916 -0.0312222 0.0577981 -0.0581811 0.0665613 -0.021338 0.0238452 -0.0273903 0.0942537 0.1156404 -0.0004489 0.0247798 -0.0168051 0.0892109 0.0277195 -0.0175396 -0.0305773 -0.1253837 0.0826599 -0.0927856 -0.0423672 -0.0463046 -0.0831853 -0.059889 -0.0416244 -0.0762253 0.0667808 -0.1847075 0.0313623 0.0578056 0.0583026 0.0665132 0.0213049 0.0238582 0.0273735 0.0942464 0.1156175 0.0004245 0.0247635 0.0167423 0.0892022 -0.02774 -0.0174166 0.0305779 -0.1254034 unknown
polarizability: 82.537297|-0.0091294|42.0698906|-5.1951067|0.0014734|34.9340068 unknown
InChI: InChI=1S/C3H7I/c1-3(2)4/h3H,1-2H3
charge 0 multiplicity 1
11 atoms
I  1.971682 -0.000651 -0.072101
C  -0.240137 0.000028 0.395278
C  -0.867485 -1.285796 -0.157239
C  -0.866734 1.286225 -0.157234
H  -0.225051 0.000023 1.498124
H  -0.396182 -2.188143 0.266208
H  -1.945235 -1.298684 0.10571
H  -0.780936 -1.329581 -1.256896
H  -0.394872 2.188296 0.266188
H  -1.944462 1.299746 0.105756
H  -0.780189 1.329937 -1.256895
