program: Orca
programVersion: 5.0.2
elementType: O O O O N N C C C C C C C C C C C C C C C C C C H H H H H H H H H H H H H H H H H H H H H H H H
charge: 0
multiplicity: 1
keywords: wb97x-d3
keywords: def2-TZVPP
keywords: def2/J RIJCOSX
keywords: DEFGRID2
keywords: scfconv7
keywords: smallprint printgap noloewdin
keywords: NOSOSCF
formula: C18H24N2O4
InChI: InChI=1/C18H24N2O4/c1-6-18(3,7-2)14-11-15(24-20-14)19-17(21)16-12(22-4)9-8-10-13(16)23-5/h8-11,19H,6-7H2,1-5H3
48 atoms
O  1.701929 -1.263143 -0.630611
O  -1.185924 1.254234 0.836868
O  -2.410806 -2.015687 1.433137
O  -3.060306 1.527605 -1.471198
N  3.015036 -0.895259 -0.441657
N  -0.431647 -0.564049 -0.276113
C  4.237568 1.015631 0.504148
C  5.499841 0.155929 0.328522
C  4.303173 2.247713 -0.427036
C  2.985071 0.255091 0.165567
C  4.134622 1.522764 1.946416
C  5.683185 -0.969586 1.338108
C  4.381602 1.955725 -1.917178
C  1.650232 0.686707 0.396857
C  0.907781 -0.317084 -0.135406
C  -1.417418 0.227662 0.234293
C  -2.800648 -0.264254 -0.03006
C  -3.284909 -1.39908 0.622197
C  -3.630435 0.466257 -0.883259
C  -4.600348 -1.810858 0.419715
C  -4.946335 0.059294 -1.089548
C  -5.405462 -1.071187 -0.431526
C  -2.810123 -3.20308 2.093164
C  -3.841644 2.339259 -2.328313
H  5.524401 -0.263477 -0.679302
H  6.360566 0.829513 0.393717
H  3.429307 2.876493 -0.232022
H  3.32826 2.249966 2.056895
H  5.06268 2.019356 2.23813
H  3.948692 0.718176 2.658598
H  6.568094 -1.557505 1.087766
H  5.828271 -0.594894 2.352001
H  4.83483 -1.65421 1.353558
H  5.285562 1.409356 -2.188018
H  3.526028 1.377698 -2.270163
H  4.39149 2.889883 -2.481072
H  -0.698636 -1.401677 -0.778794
H  -5.003313 -2.683615 0.913719
H  -5.611299 0.600457 -1.747717
H  -6.428565 -1.387478 -0.589028
H  -1.947165 -3.539562 2.663277
H  -3.090419 -3.98748 1.385671
H  -3.638765 -3.027015 2.783168
H  -4.199928 1.786256 -3.199997
H  -4.69437 2.780306 -1.806134
H  -3.189169 3.140574 -2.667885
H  1.322661 1.594043 0.868802
H  5.173306 2.840414 -0.127614
elementType: O N C H
totalener: -1110.85364444 hartree
nucrepener: 2091.61434134 hartree
electener: -3202.46798578 hartree
oneelecener: -5668.85199102 hartree
twoeener: 2466.38400524 hartree
cpcmener: -0.03434566 hartree
kineticenergy: 1106.02380974 hartree
xcener: -106.815508256427 hartree
chargesum: -0.0000000
charge: -0.176993 -0.455836 -0.320404 -0.307131 -0.213046 -0.140149 0.493183 -0.184201 -0.170674 -0.133209 -0.371490 -0.303431 -0.296890 -0.286890 0.284839 0.382859 -0.213761 0.360249 0.342221 -0.296478 -0.290047 -0.125965 -0.132455 -0.132750 0.076285 0.081636 0.082753 0.102069 0.106318 0.108989 0.094656 0.085404 0.087624 0.087095 0.088562 0.097774 0.194060 0.141280 0.140556 0.158750 0.123170 0.113385 0.114766 0.113353 0.113765 0.122332 0.169823 0.084045
qa: -0.1770 -0.4558 -0.3204 -0.3071 -0.2130 -0.1401 0.4932 -0.1842 -0.1707 -0.1332 -0.3715 -0.3034 -0.2969 -0.2869 0.2848 0.3829 -0.2138 0.3602 0.3422 -0.2965 -0.2900 -0.1260 -0.1325 -0.1328 0.0763 0.0816 0.0828 0.1021 0.1063 0.1090 0.0947 0.0854 0.0876 0.0871 0.0886 0.0978 0.1941 0.1413 0.1406 0.1587 0.1232 0.1134 0.1148 0.1134 0.1138 0.1223 0.1698 0.0840
va: 2.2055 2.0572 2.0798 2.0998 2.7587 3.2349 3.5068 3.8317 3.8445 4.1928 3.9320 3.9493 3.9584 3.9460 4.1018 4.0896 3.5733 3.8477 3.8793 3.9306 3.9315 3.9370 3.8750 3.8765 1.0139 1.0062 1.0084 1.0060 0.9992 0.9961 1.0030 0.9958 1.0093 0.9973 0.9983 1.0035 1.0042 1.0103 1.0100 0.9911 0.9938 0.9863 0.9853 0.9852 0.9855 0.9942 1.0103 1.0064
dispcorr: -0.022046303 hartree
energy: -1110.875690746992
dipole: 24.69902 -26.81122 -2.11220 6.46702 -7.13206 -0.66504 1.56903 -2.10474 -0.53571
magnitude: 2.27829 au
magnitude: 5.79096 debye
