program: Orca
programVersion: 5.0.2
elementType: O O O O N N C C C C C C C C C C C C C C C C C C H H H H H H H H H H H H H H H H H H H H H H H H
charge: 0
multiplicity: 1
keywords: wb97x-d3
keywords: def2-TZVPP
keywords: def2/J RIJCOSX
keywords: DEFGRID2
keywords: scfconv7
keywords: smallprint printgap noloewdin
keywords: NOSOSCF
formula: C18H24N2O4
InChI: InChI=1/C18H24N2O4/c1-6-18(3,7-2)14-11-15(24-20-14)19-17(21)16-12(22-4)9-8-10-13(16)23-5/h8-11,19H,6-7H2,1-5H3
48 atoms
O  1.197668 1.757463 0.49855
O  -0.700915 -1.753055 -0.478168
O  -2.611086 -1.904431 1.845974
O  -2.759472 0.666922 -1.999515
N  2.573125 1.763118 0.481657
N  -0.603424 0.425618 0.122691
C  4.387206 0.208012 -0.07563
C  4.740792 0.331506 -1.576028
C  5.302675 1.118304 0.760255
C  2.936653 0.573375 0.098656
C  4.584608 -1.25649 0.328043
C  4.671141 1.727664 -2.175109
C  5.188099 0.958144 2.270063
C  1.809879 -0.256704 -0.153199
C  0.759987 0.558091 0.124394
C  -1.269697 -0.725852 -0.176174
C  -2.754786 -0.61669 -0.071972
C  -3.40943 -1.27636 0.970266
C  -3.485868 0.081912 -1.033821
C  -4.79878 -1.233071 1.056259
C  -4.876181 0.125441 -0.954641
C  -5.50467 -0.533743 0.089883
C  -3.197684 -2.599368 2.931268
C  -3.428436 1.395095 -3.013621
H  5.753465 -0.063769 -1.705422
H  4.083029 -0.335424 -2.141895
H  6.333728 0.908152 0.458192
H  4.2165 -1.466051 1.332753
H  5.645459 -1.513376 0.301091
H  4.07121 -1.932901 -0.35752
H  3.682289 2.175887 -2.06832
H  5.394588 2.408447 -1.725221
H  4.893223 1.686746 -3.242946
H  5.508003 -0.028364 2.607391
H  5.822045 1.68864 2.775179
H  4.168909 1.116565 2.624637
H  -1.145057 1.237163 0.392967
H  -5.333702 -1.728132 1.854346
H  -5.470218 0.655119 -1.68587
H  -6.584708 -0.501371 0.15385
H  -3.76088 -1.931149 3.587345
H  -2.375044 -3.031113 3.496821
H  -3.85131 -3.406655 2.592131
H  -3.990673 2.238914 -2.606181
H  -2.654379 1.778605 -3.674366
H  -4.102199 0.760144 -3.593933
H  1.804155 -1.280928 -0.475181
H  5.122121 2.163321 0.50165
elementType: O N C H
totalener: -1110.85371229 hartree
nucrepener: 2088.91160335 hartree
electener: -3199.76531564 hartree
oneelecener: -5663.43406521 hartree
twoeener: 2463.66874957 hartree
cpcmener: -0.03424749 hartree
kineticenergy: 1106.01176394 hartree
xcener: -106.813114540845 hartree
chargesum: 0.0000000
charge: -0.174913 -0.454449 -0.306852 -0.319223 -0.219421 -0.138861 0.489046 -0.160402 -0.186528 -0.110204 -0.376456 -0.301779 -0.299319 -0.300330 0.284278 0.377050 -0.216130 0.346406 0.364019 -0.292705 -0.298880 -0.124574 -0.133625 -0.132744 0.082710 0.082753 0.082033 0.111843 0.105625 0.101778 0.087708 0.086848 0.097639 0.085121 0.095543 0.087022 0.193945 0.140422 0.141315 0.158422 0.113059 0.122594 0.114066 0.113434 0.123101 0.114540 0.168523 0.076553
qa: -0.1749 -0.4544 -0.3069 -0.3192 -0.2194 -0.1389 0.4890 -0.1604 -0.1865 -0.1102 -0.3765 -0.3018 -0.2993 -0.3003 0.2843 0.3771 -0.2161 0.3464 0.3640 -0.2927 -0.2989 -0.1246 -0.1336 -0.1327 0.0827 0.0828 0.0820 0.1118 0.1056 0.1018 0.0877 0.0868 0.0976 0.0851 0.0955 0.0870 0.1939 0.1404 0.1413 0.1584 0.1131 0.1226 0.1141 0.1134 0.1231 0.1145 0.1685 0.0766
va: 2.2060 2.0575 2.0979 2.0793 2.7450 3.2315 3.4837 3.8457 3.8411 4.1766 3.9278 3.9573 3.9537 3.9500 4.1011 4.0883 3.5710 3.8785 3.8482 3.9343 3.9325 3.9361 3.8766 3.8758 1.0052 1.0080 1.0057 0.9962 1.0000 1.0060 1.0039 0.9954 1.0040 0.9962 1.0032 1.0062 1.0037 1.0101 1.0103 0.9912 0.9855 0.9941 0.9852 0.9856 0.9939 0.9857 1.0102 1.0134
dispcorr: -0.021977661 hartree
energy: -1110.875689950929
dipole: 25.69333 -27.92804 -2.23471 1.80086 -1.59173 0.20912 -0.45900 0.51268 0.05368
magnitude: 2.24512 au
magnitude: 5.70664 debye
