program: Orca
programVersion: 5.0.2
elementType: O O O O N N C C C C C C C C C C C C C C C C C C H H H H H H H H H H H H H H H H H H H H H H H H
charge: 0
multiplicity: 1
keywords: wb97x-d3
keywords: def2-TZVPP
keywords: def2/J RIJCOSX
keywords: DEFGRID2
keywords: scfconv7
keywords: smallprint printgap noloewdin
keywords: NOSOSCF
formula: C18H24N2O4
InChI: InChI=1/C18H24N2O4/c1-6-18(3,7-2)14-11-15(24-20-14)19-17(21)16-12(22-4)9-8-10-13(16)23-5/h8-11,19H,6-7H2,1-5H3
48 atoms
O  1.318877 1.463483 -1.177074
O  -0.761986 -1.082109 1.23149
O  -2.425262 -2.98776 -0.141237
O  -2.811355 1.643053 -0.110292
N  2.637101 1.699716 -0.86537
N  -0.447113 0.13234 -0.645891
C  4.338209 0.771971 0.634185
C  4.256418 0.727022 2.171919
C  4.97972 -0.551651 0.162938
C  2.949504 0.845916 0.064833
C  5.186004 1.960784 0.185201
C  3.585772 1.917863 2.837966
C  5.121227 -0.72299 -1.340838
C  1.845558 0.012384 0.396346
C  0.86385 0.46276 -0.424561
C  -1.220722 -0.573947 0.230515
C  -2.660378 -0.675354 -0.14748
C  -3.247937 -1.939871 -0.280559
C  -3.447276 0.474464 -0.286966
C  -4.606359 -2.051258 -0.568059
C  -4.80635 0.364619 -0.570928
C  -5.359952 -0.897443 -0.70636
C  -2.952335 -4.295324 -0.267725
C  -3.542876 2.849299 -0.222372
H  3.738373 -0.188427 2.472229
H  5.278077 0.628804 2.550944
H  5.967068 -0.623072 0.629537
H  4.762864 2.912897 0.504224
H  5.297699 2.009752 -0.896996
H  6.185906 1.880938 0.616606
H  2.546445 2.032015 2.525969
H  3.583436 1.790315 3.920639
H  4.099916 2.855248 2.627817
H  5.563759 -1.693421 -1.568058
H  4.158479 -0.681013 -1.852709
H  5.766464 0.034446 -1.78575
H  -0.887073 0.541011 -1.460531
H  -5.082016 -3.014421 -0.685327
H  -5.434384 1.237283 -0.680248
H  -6.416148 -0.985317 -0.92614
H  -3.715767 -4.502337 0.48592
H  -2.117833 -4.975434 -0.113348
H  -3.370258 -4.473288 -1.261543
H  -4.339227 2.912806 0.522141
H  -2.83258 3.652945 -0.043603
H  -3.971514 2.975797 -1.218823
H  1.812256 -0.786297 1.114044
H  4.395852 -1.38513 0.564286
elementType: O N C H
totalener: -1110.85450663 hartree
nucrepener: 2098.22615570 hartree
electener: -3209.08066233 hartree
oneelecener: -5682.09853535 hartree
twoeener: 2473.01787302 hartree
cpcmener: -0.03521907 hartree
kineticenergy: 1106.02945284 hartree
xcener: -106.817831991554 hartree
chargesum: -0.0000000
charge: -0.173456 -0.457679 -0.308053 -0.324600 -0.201914 -0.152277 0.487945 -0.188420 -0.168247 -0.177747 -0.369620 -0.284416 -0.297817 -0.276316 0.301972 0.382506 -0.194349 0.336614 0.351229 -0.285895 -0.292024 -0.127364 -0.129728 -0.130655 0.082088 0.084689 0.083884 0.105609 0.098630 0.104401 0.087433 0.096865 0.085207 0.097684 0.087865 0.086565 0.190662 0.140036 0.140790 0.158553 0.114163 0.122548 0.112676 0.115050 0.122805 0.113849 0.165671 0.082586
qa: -0.1735 -0.4577 -0.3081 -0.3246 -0.2019 -0.1523 0.4879 -0.1884 -0.1682 -0.1777 -0.3696 -0.2844 -0.2978 -0.2763 0.3020 0.3825 -0.1943 0.3366 0.3512 -0.2859 -0.2920 -0.1274 -0.1297 -0.1307 0.0821 0.0847 0.0839 0.1056 0.0986 0.1044 0.0874 0.0969 0.0852 0.0977 0.0879 0.0866 0.1907 0.1400 0.1408 0.1586 0.1142 0.1225 0.1127 0.1150 0.1228 0.1138 0.1657 0.0826
va: 2.2052 2.0542 2.1043 2.0809 2.8009 3.2436 3.4586 3.8532 3.8480 4.2297 3.9452 3.9468 3.9627 3.9319 4.0767 4.1133 3.5728 3.8742 3.8491 3.9185 3.9204 3.9426 3.8737 3.8750 1.0075 1.0068 1.0070 1.0045 1.0076 1.0008 0.9983 1.0036 1.0001 1.0036 0.9977 0.9981 1.0083 1.0106 1.0107 0.9914 0.9856 0.9941 0.9859 0.9862 0.9938 0.9859 1.0107 1.0078
dispcorr: -0.022199543 hartree
energy: -1110.876706175946
dipole: 23.63278 -25.79483 -2.16205 2.25246 -2.75703 -0.50458 5.37082 -6.13011 -0.75929
magnitude: 2.34639 au
magnitude: 5.96406 debye
