program: Orca
programVersion: 5.0.2
elementType: O O O O N N C C C C C C C C C C C C C C C C C C H H H H H H H H H H H H H H H H H H H H H H H H
charge: 0
multiplicity: 1
keywords: wb97x-d3
keywords: def2-TZVPP
keywords: def2/J RIJCOSX
keywords: DEFGRID2
keywords: scfconv7
keywords: smallprint printgap noloewdin
keywords: NOSOSCF
formula: C18H24N2O4
InChI: InChI=1/C18H24N2O4/c1-6-18(3,7-2)14-11-15(24-20-14)19-17(21)16-12(22-4)9-8-10-13(16)23-5/h8-11,19H,6-7H2,1-5H3
48 atoms
O  1.390242 0.425161 1.821462
O  -0.766099 -0.288083 -1.595146
O  -2.225696 -2.209891 1.086307
O  -3.090008 1.492598 -1.571931
N  2.755234 0.554571 1.694378
N  -0.508448 0.103637 0.615567
C  4.411899 0.528551 -0.11461
C  4.757821 -0.815827 -0.789747
C  4.458648 1.622385 -1.201365
C  3.011772 0.443828 0.424364
C  5.418536 0.840867 0.991141
C  4.754514 -2.033713 0.121282
C  4.052548 3.017899 -0.754221
C  1.825056 0.237166 -0.331875
C  0.854192 0.239658 0.616604
C  -1.253927 -0.190283 -0.488981
C  -2.712549 -0.36112 -0.227567
C  -3.174817 -1.420792 0.558992
C  -3.624497 0.499548 -0.847836
C  -4.542607 -1.615105 0.736631
C  -4.992765 0.309288 -0.670015
C  -5.425384 -0.744262 0.11915
C  -2.614216 -3.298408 1.904606
C  -3.952693 2.372183 -2.269344
H  4.058828 -0.983024 -1.614458
H  5.745542 -0.709902 -1.248994
H  5.478767 1.650361 -1.595972
H  5.223079 1.799109 1.472301
H  6.424485 0.882926 0.568324
H  5.4227 0.085641 1.776603
H  5.516141 -1.970955 0.899193
H  3.79038 -2.180251 0.61194
H  4.961129 -2.936286 -0.455785
H  3.02759 3.047519 -0.379869
H  4.70262 3.409646 0.028784
H  4.107354 3.713371 -1.593076
H  -0.978309 0.183778 1.508543
H  -4.926473 -2.428446 1.335976
H  -5.719797 0.963876 -1.129316
H  -6.488824 -0.892736 0.25587
H  -3.169377 -2.968176 2.785936
H  -1.69389 -3.7769 2.231554
H  -3.212427 -4.028432 1.354344
H  -3.310266 3.067783 -2.804468
H  -4.57508 1.841693 -2.99409
H  -4.594371 2.939326 -1.590813
H  1.733865 0.121046 -1.395652
H  3.822544 1.316188 -2.037381
elementType: O N C H
totalener: -1110.85537938 hartree
nucrepener: 2097.92609641 hartree
electener: -3208.78147579 hartree
oneelecener: -5681.44777768 hartree
twoeener: 2472.66630189 hartree
cpcmener: -0.03510795 hartree
kineticenergy: 1106.01181303 hartree
xcener: -106.814055704976 hartree
chargesum: -0.0000000
charge: -0.176664 -0.456708 -0.323872 -0.308944 -0.195585 -0.142666 0.504423 -0.176847 -0.183080 -0.205640 -0.373639 -0.295725 -0.286587 -0.272644 0.301739 0.386204 -0.203071 0.352241 0.342479 -0.293480 -0.289505 -0.127123 -0.132640 -0.130318 0.083366 0.083781 0.083741 0.104959 0.105021 0.100777 0.085776 0.088844 0.097499 0.087194 0.084882 0.097063 0.192459 0.141621 0.140776 0.158102 0.114284 0.122760 0.115323 0.122576 0.114141 0.112272 0.167945 0.082495
qa: -0.1767 -0.4567 -0.3239 -0.3089 -0.1956 -0.1427 0.5044 -0.1768 -0.1831 -0.2056 -0.3736 -0.2957 -0.2866 -0.2726 0.3017 0.3862 -0.2031 0.3522 0.3425 -0.2935 -0.2895 -0.1271 -0.1326 -0.1303 0.0834 0.0838 0.0837 0.1050 0.1050 0.1008 0.0858 0.0888 0.0975 0.0872 0.0849 0.0971 0.1925 0.1416 0.1408 0.1581 0.1143 0.1228 0.1153 0.1226 0.1141 0.1123 0.1679 0.0825
va: 2.2043 2.0570 2.0798 2.1021 2.8026 3.2393 3.4323 3.8509 3.8562 4.2582 3.9462 3.9575 3.9504 3.9268 4.0840 4.0966 3.5659 3.8478 3.8716 3.9247 3.9232 3.9413 3.8750 3.8748 1.0071 1.0069 1.0077 1.0053 1.0002 1.0052 0.9981 0.9978 1.0036 0.9978 1.0002 1.0034 1.0064 1.0101 1.0102 0.9915 0.9856 0.9938 0.9859 0.9942 0.9861 0.9853 1.0114 1.0072
dispcorr: -0.022191995 hartree
energy: -1110.877571379663
dipole: 23.92663 -26.20838 -2.28175 2.16714 -2.42438 -0.25723 -3.58151 3.86564 0.28414
magnitude: 2.31372 au
magnitude: 5.88101 debye
