program: Orca
programVersion: 5.0.2
elementType: O O O O N N C C C C C C C C C C C C C C C C C C H H H H H H H H H H H H H H H H H H H H H H H H
charge: 0
multiplicity: 1
keywords: wb97x-d3
keywords: def2-TZVPP
keywords: def2/J RIJCOSX
keywords: DEFGRID2
keywords: scfconv7
keywords: smallprint printgap noloewdin
keywords: NOSOSCF
formula: C18H24N2O4
InChI: InChI=1/C18H24N2O4/c1-6-18(3,7-2)14-11-15(24-20-14)19-17(21)16-12(22-4)9-8-10-13(16)23-5/h8-11,19H,6-7H2,1-5H3
48 atoms
O  1.074488 2.216068 1.20786
O  -3.124415 0.897355 2.068852
O  -2.338332 -2.016765 1.644486
O  -1.822011 1.685289 -1.074969
N  2.254672 1.9371 0.567251
N  -0.935341 1.291072 1.7721
C  3.254206 0.044061 -0.630215
C  3.733793 -1.181794 0.175945
C  2.683304 -0.470358 -1.968284
C  2.149925 0.716133 0.134152
C  4.416955 1.002561 -0.880523
C  4.253747 -0.889334 1.575873
C  2.092505 0.592179 -2.883143
C  0.902568 0.141279 0.496151
C  0.281853 1.148787 1.158077
C  -2.128166 0.69057 1.428354
C  -2.096695 -0.201621 0.229172
C  -2.254153 -1.57728 0.380168
C  -1.970755 0.351933 -1.04326
C  -2.27059 -2.40391 -0.742227
C  -1.988893 -0.466655 -2.16919
C  -2.139584 -1.832226 -1.996621
C  -2.545901 -3.387272 1.876154
C  -1.684122 2.328009 -2.318603
H  2.910108 -1.899154 0.246378
H  4.51424 -1.680944 -0.407114
H  3.484381 -1.000005 -2.493333
H  4.109499 1.877941 -1.450197
H  5.201955 0.491373 -1.441273
H  4.849492 1.371856 0.047475
H  3.495782 -0.413739 2.198504
H  4.549394 -1.814844 2.070313
H  5.127038 -0.237782 1.5638
H  1.657635 0.129762 -3.769688
H  1.302007 1.153379 -2.383133
H  2.840733 1.307021 -3.223846
H  -1.00452 1.990038 2.498735
H  -2.384732 -3.474622 -0.654701
H  -1.890553 -0.061455 -3.165733
H  -2.154943 -2.472353 -2.868763
H  -3.47502 -3.744241 1.422797
H  -2.616005 -3.509327 2.954016
H  -1.715953 -3.998654 1.508632
H  -0.79936 1.984499 -2.861553
H  -2.565816 2.188397 -2.950401
H  -1.5708 3.387785 -2.105392
H  0.544756 -0.852854 0.299618
H  1.91585 -1.222091 -1.759592
totalener: -1110.82703233 hartree
nucrepener: 2238.97390509 hartree
electener: -3349.80093742 hartree
oneelecener: -5961.94983364 hartree
twoeener: 2612.14889622 hartree
kineticenergy: 1106.09608080 hartree
xcener: -106.824587440566 hartree
chargesum: -0.0000000
charge: -0.148578 -0.324330 -0.267302 -0.285768 -0.139397 -0.155570 0.430024 -0.164379 -0.153344 -0.159042 -0.341830 -0.267127 -0.280816 -0.274135 0.286649 0.270447 -0.237128 0.344274 0.426052 -0.261142 -0.285532 -0.100414 -0.150433 -0.146268 0.067937 0.076888 0.078473 0.102675 0.092129 0.104009 0.091865 0.087698 0.079489 0.091798 0.071069 0.090922 0.150172 0.111328 0.109672 0.124650 0.104596 0.119334 0.097616 0.087500 0.114995 0.122635 0.140673 0.066965
qa: -0.1486 -0.3243 -0.2673 -0.2858 -0.1394 -0.1556 0.4300 -0.1644 -0.1533 -0.1590 -0.3418 -0.2671 -0.2808 -0.2741 0.2866 0.2704 -0.2371 0.3443 0.4261 -0.2611 -0.2855 -0.1004 -0.1504 -0.1463 0.0679 0.0769 0.0785 0.1027 0.0921 0.1040 0.0919 0.0877 0.0795 0.0918 0.0711 0.0909 0.1502 0.1113 0.1097 0.1247 0.1046 0.1193 0.0976 0.0875 0.1150 0.1226 0.1407 0.0670
va: 2.2405 2.1933 2.1193 2.1007 2.8268 3.1789 3.5932 3.8627 3.8500 4.1049 3.9590 3.9612 3.9685 3.8690 4.0843 4.2825 3.5411 3.8866 3.7605 3.9748 3.9893 4.0144 3.9149 3.8979 1.0090 1.0085 1.0109 1.0080 1.0006 1.0106 1.0004 1.0037 1.0050 1.0032 0.9884 1.0080 1.0411 1.0172 1.0170 1.0012 0.9858 0.9980 0.9841 0.9823 0.9877 0.9979 0.9933 1.0133
dispcorr: -0.026927420 hartree
energy: -1110.853959749454
dipole: 24.47792 -24.21898 0.25894 -10.76653 9.31713 -1.44940 -15.02478 13.78614 -1.23864
magnitude: 1.92407 au
magnitude: 4.89059 debye
