program: Orca
programVersion: 5.0.2
elementType: O O O O N N C C C C C C C C C C C C C C C C C C H H H H H H H H H H H H H H H H H H H H H H H H
charge: 0
multiplicity: 1
keywords: wb97x-d3
keywords: def2-TZVPP
keywords: def2/J RIJCOSX
keywords: DEFGRID2
keywords: scfconv7
keywords: smallprint printgap noloewdin
keywords: NOSOSCF
formula: C18H24N2O4
InChI: InChI=1/C18H24N2O4/c1-6-18(3,7-2)14-11-15(24-20-14)19-17(21)16-12(22-4)9-8-10-13(16)23-5/h8-11,19H,6-7H2,1-5H3
48 atoms
O  1.183425 0.78606 2.228024
O  -3.146767 1.636088 1.427497
O  -1.402818 -1.443467 1.683561
O  -2.674937 1.61432 -1.608758
N  2.360071 0.32553 1.703127
N  -0.911895 1.495521 1.603496
C  3.277919 -0.183678 -0.514909
C  2.711842 -1.302415 -1.413263
C  3.681555 0.991114 -1.430757
C  2.194165 0.282309 0.413748
C  4.490704 -0.690893 0.264043
C  2.156592 -2.515665 -0.682938
C  4.243558 2.215521 -0.724149
C  0.901631 0.743452 0.046328
C  0.327086 1.028576 1.238112
C  -2.120122 1.117737 1.067208
C  -2.077597 0.035309 0.036105
C  -1.736512 -1.272216 0.395059
C  -2.424015 0.3247 -1.274732
C  -1.755959 -2.280124 -0.560653
C  -2.438916 -0.679304 -2.238413
C  -2.106154 -1.968286 -1.868158
C  -0.982818 -2.711757 2.122871
C  -4.045841 1.936494 -1.771355
H  1.924287 -0.884377 -2.047811
H  3.507837 -1.617133 -2.095047
H  4.417051 0.61684 -2.150145
H  4.909478 0.074454 0.914685
H  5.269476 -1.006965 -0.4329
H  4.242148 -1.538796 0.900263
H  2.916223 -3.027864 -0.09287
H  1.342524 -2.235655 -0.013685
H  1.755993 -3.236668 -1.396009
H  5.18197 2.000825 -0.213797
H  4.442784 3.009237 -1.444269
H  3.548318 2.612759 0.015727
H  -0.965582 2.126742 2.390593
H  -1.496601 -3.298775 -0.309323
H  -2.685909 -0.440907 -3.264444
H  -2.110954 -2.755088 -2.610905
H  -0.097274 -3.059699 1.583887
H  -1.774365 -3.460821 2.028621
H  -0.72753 -2.602344 3.173714
H  -4.092195 2.989707 -2.040309
H  -4.508624 1.349532 -2.570581
H  -4.602423 1.780403 -0.845412
H  0.480098 0.851923 -0.937139
H  2.811533 1.289732 -2.023784
totalener: -1110.82372555 hartree
nucrepener: 2247.70142128 hartree
electener: -3358.52514683 hartree
oneelecener: -5979.52631311 hartree
twoeener: 2621.00116629 hartree
kineticenergy: 1106.09988611 hartree
xcener: -106.821445987032 hartree
chargesum: -0.0000000
charge: -0.140321 -0.349125 -0.289051 -0.335538 -0.137719 -0.149642 0.439141 -0.167813 -0.164876 -0.163669 -0.344567 -0.232923 -0.270874 -0.241921 0.250215 0.296583 -0.125269 0.383417 0.203722 -0.283732 -0.202168 -0.086007 -0.145870 -0.105406 0.071196 0.078320 0.076766 0.104924 0.092713 0.100920 0.092218 0.027773 0.090491 0.078518 0.089361 0.092659 0.149844 0.114513 0.123272 0.126061 0.097569 0.111544 0.123658 0.111190 0.085318 0.109932 0.142517 0.072137
qa: -0.1403 -0.3491 -0.2891 -0.3355 -0.1377 -0.1496 0.4391 -0.1678 -0.1649 -0.1637 -0.3446 -0.2329 -0.2709 -0.2419 0.2502 0.2966 -0.1253 0.3834 0.2037 -0.2837 -0.2022 -0.0860 -0.1459 -0.1054 0.0712 0.0783 0.0768 0.1049 0.0927 0.1009 0.0922 0.0278 0.0905 0.0785 0.0894 0.0927 0.1498 0.1145 0.1233 0.1261 0.0976 0.1115 0.1237 0.1112 0.0853 0.1099 0.1425 0.0721
va: 2.2446 2.1624 2.1016 2.0014 2.8255 3.1775 3.5766 3.8795 3.8604 4.0886 3.9605 3.9590 3.9636 3.8844 4.0849 4.2656 3.5721 3.7353 3.9355 3.9511 4.0727 3.9687 3.9000 3.8750 1.0121 1.0111 1.0079 1.0092 1.0006 1.0092 1.0078 0.9984 1.0064 1.0034 1.0042 1.0008 1.0397 1.0147 1.0072 0.9989 0.9780 0.9861 0.9981 0.9953 0.9879 1.0010 0.9973 1.0092
dispcorr: -0.027960538 hartree
energy: -1110.851686083207
dipole: 22.20196 -22.10703 0.09493 -9.58034 8.55535 -1.02498 -13.22524 12.15546 -1.06978
magnitude: 1.48460 au
magnitude: 3.77355 debye
