program: Orca
programVersion: 5.0.2
elementType: O O O O N N C C C C C C C C C C C C C C C C C C H H H H H H H H H H H H H H H H H H H H H H H H
charge: 0
multiplicity: 1
keywords: wb97x-d3
keywords: def2-TZVPP
keywords: def2/J RIJCOSX
keywords: DEFGRID2
keywords: scfconv7
keywords: smallprint printgap noloewdin
keywords: NOSOSCF
formula: C18H24N2O4
InChI: InChI=1/C18H24N2O4/c1-6-18(3,7-2)14-11-15(24-20-14)19-17(21)16-12(22-4)9-8-10-13(16)23-5/h8-11,19H,6-7H2,1-5H3
48 atoms
O  1.120331 1.556791 1.1301
O  -0.710861 -1.622382 -0.750785
O  -2.674674 -2.047623 1.742084
O  -2.747489 0.777076 -1.910232
N  2.492497 1.610145 1.098828
N  -0.650325 0.313595 0.427158
C  4.334522 0.28653 0.157217
C  4.575029 0.378511 -1.36364
C  5.217887 1.274344 0.940895
C  2.878227 0.571716 0.418906
C  4.618005 -1.150522 0.613233
C  4.364192 1.758365 -1.968068
C  6.713562 1.152188 0.679455
C  1.77078 -0.203766 -0.026404
C  0.709953 0.481914 0.463771
C  -1.290517 -0.73053 -0.189621
C  -2.783936 -0.64268 -0.088552
C  -3.457913 -1.372326 0.887647
C  -3.497789 0.105167 -1.02122
C  -4.850253 -1.353328 0.935444
C  -4.890176 0.125506 -0.984216
C  -5.540308 -0.606923 -0.005028
C  -3.274728 -2.845817 2.732104
C  -3.386848 1.507178 -2.928069
H  5.591383 0.034926 -1.575656
H  3.916018 -0.337477 -1.863474
H  4.90168 2.296931 0.728168
H  4.435568 -1.268841 1.682139
H  5.653967 -1.427292 0.41562
H  3.989097 -1.870649 0.088509
H  4.501202 1.72675 -3.049047
H  3.359361 2.134416 -1.774677
H  5.069674 2.490269 -1.573896
H  6.974376 1.376146 -0.355698
H  7.259447 1.858597 1.305116
H  7.100884 0.159103 0.909055
H  -1.212767 1.017397 0.878937
H  -5.399217 -1.90735 1.683116
H  -5.468642 0.69477 -1.69737
H  -6.621679 -0.593931 0.027541
H  -3.87604 -2.255133 3.429638
H  -2.462352 -3.313598 3.282494
H  -3.902474 -3.631114 2.301355
H  -4.000814 2.320092 -2.528871
H  -2.597362 1.936809 -3.539584
H  -4.011881 0.869591 -3.559695
H  1.764548 -1.109791 -0.601727
H  5.027126 1.132663 2.007632
totalener: -1110.83090963 hartree
nucrepener: 2082.95893824 hartree
electener: -3193.78984787 hartree
oneelecener: -5650.47828018 hartree
twoeener: 2456.68843231 hartree
kineticenergy: 1106.08171815 hartree
xcener: -106.820204170262 hartree
chargesum: -0.0000000
charge: -0.162928 -0.355820 -0.263798 -0.276112 -0.163479 -0.148048 0.418175 -0.199898 -0.171730 -0.112870 -0.334278 -0.268628 -0.275725 -0.240073 0.249003 0.373575 -0.260891 0.364105 0.353306 -0.264717 -0.264588 -0.106941 -0.155118 -0.151904 0.079043 0.081093 0.087363 0.104313 0.089531 0.094635 0.088787 0.096087 0.073561 0.072941 0.091793 0.077713 0.153202 0.109904 0.110621 0.124280 0.100338 0.118746 0.105233 0.099994 0.119751 0.104633 0.154034 0.081785
qa: -0.1629 -0.3558 -0.2638 -0.2761 -0.1635 -0.1480 0.4182 -0.1999 -0.1717 -0.1129 -0.3343 -0.2686 -0.2757 -0.2401 0.2490 0.3736 -0.2609 0.3641 0.3533 -0.2647 -0.2646 -0.1069 -0.1551 -0.1519 0.0790 0.0811 0.0874 0.1043 0.0895 0.0946 0.0888 0.0961 0.0736 0.0729 0.0918 0.0777 0.1532 0.1099 0.1106 0.1243 0.1003 0.1187 0.1052 0.1000 0.1198 0.1046 0.1540 0.0818
va: 2.2247 2.1579 2.1202 2.1061 2.8171 3.2017 3.6165 3.8937 3.8955 4.0775 3.9383 3.9562 3.9261 3.9577 4.1395 4.0538 3.6439 3.8861 3.8889 3.9891 3.9906 4.0269 3.9139 3.9134 0.9981 1.0105 1.0115 1.0072 1.0026 1.0068 1.0048 1.0004 1.0028 1.0015 1.0063 1.0019 1.0300 1.0181 1.0177 1.0024 0.9840 0.9982 0.9852 0.9840 0.9978 0.9862 1.0157 1.0179
dispcorr: -0.022032150 hartree
energy: -1110.852941777272
dipole: 27.91145 -29.68592 -1.77447 2.67363 -2.71125 -0.03762 -4.00132 3.98816 -0.01316
magnitude: 1.77491 au
magnitude: 4.51147 debye
