program: Orca
programVersion: 5.0.2
elementType: O O O O N N C C C C C C C C C C C C C C C C C C H H H H H H H H H H H H H H H H H H H H H H H H
charge: 0
multiplicity: 1
keywords: wb97x-d3
keywords: def2-TZVPP
keywords: def2/J RIJCOSX
keywords: DEFGRID2
keywords: scfconv7
keywords: smallprint printgap noloewdin
keywords: NOSOSCF
formula: C18H24N2O4
InChI: InChI=1/C18H24N2O4/c1-6-18(3,7-2)14-11-15(24-20-14)19-17(21)16-12(22-4)9-8-10-13(16)23-5/h8-11,19H,6-7H2,1-5H3
48 atoms
O  1.719274 -1.651097 0.025206
O  -1.032904 1.410912 -0.169424
O  -2.306855 -0.782398 2.227264
O  -2.996253 0.256005 -2.226497
N  3.049447 -1.313758 0.026281
N  -0.367371 -0.753318 -0.074879
C  4.416165 0.70616 -0.045429
C  4.372343 1.884743 -1.033455
C  4.709793 1.222056 1.383176
C  3.094356 -0.016403 -0.054412
C  5.547267 -0.255509 -0.420562
C  4.167687 1.502494 -2.493169
C  3.730361 2.221203 1.982747
C  1.788776 0.547604 -0.119572
C  0.98749 -0.544892 -0.062965
C  -1.310547 0.243148 -0.087055
C  -2.715388 -0.271574 0.007853
C  -3.202672 -0.744959 1.225204
C  -3.561539 -0.192793 -1.097736
C  -4.533489 -1.138387 1.34463
C  -4.892732 -0.588855 -0.986946
C  -5.355009 -1.049925 0.233818
C  -2.729767 -1.190304 3.505104
C  -3.792196 0.408435 -3.375241
H  3.582869 2.581212 -0.741064
H  5.309682 2.440809 -0.929788
H  4.7806 0.353545 2.043738
H  6.492135 0.289048 -0.473007
H  5.379671 -0.737627 -1.382331
H  5.65646 -1.047904 0.318855
H  4.079869 2.396128 -3.111466
H  4.999657 0.918785 -2.885977
H  3.2567 0.919132 -2.63229
H  2.726572 1.807572 2.075942
H  4.057348 2.505831 2.983264
H  3.661228 3.138807 1.398063
H  -0.681716 -1.708152 0.000468
H  -4.936137 -1.50276 2.278581
H  -5.568546 -0.54232 -1.828489
H  -6.390191 -1.35196 0.32169
H  -3.088748 -2.223819 3.509951
H  -3.514941 -0.541528 3.903451
H  -1.859071 -1.121558 4.152478
H  -4.614886 1.11093 -3.214494
H  -3.140444 0.807657 -4.148272
H  -4.203203 -0.544412 -3.721684
H  1.498267 1.577445 -0.202369
H  5.708744 1.670013 1.365706
totalener: -1110.83021634 hartree
nucrepener: 2101.18606081 hartree
electener: -3212.01627715 hartree
oneelecener: -5686.94960409 hartree
twoeener: 2474.93332695 hartree
kineticenergy: 1106.07788370 hartree
xcener: -106.819653938632 hartree
chargesum: -0.0000000
charge: -0.159826 -0.356088 -0.286894 -0.263084 -0.173433 -0.155781 0.460983 -0.209858 -0.151116 -0.104124 -0.331447 -0.268561 -0.288793 -0.352241 0.296266 0.378646 -0.237690 0.333783 0.357786 -0.258634 -0.259125 -0.109324 -0.149625 -0.150933 0.073197 0.078653 0.083495 0.088599 0.099556 0.100924 0.087193 0.080510 0.091732 0.094482 0.090263 0.080332 0.154033 0.110933 0.109387 0.124473 0.100126 0.106255 0.120119 0.103754 0.119381 0.099641 0.169804 0.072270
qa: -0.1598 -0.3561 -0.2869 -0.2631 -0.1734 -0.1558 0.4610 -0.2099 -0.1511 -0.1041 -0.3314 -0.2686 -0.2888 -0.3522 0.2963 0.3786 -0.2377 0.3338 0.3578 -0.2586 -0.2591 -0.1093 -0.1496 -0.1509 0.0732 0.0787 0.0835 0.0886 0.0996 0.1009 0.0872 0.0805 0.0917 0.0945 0.0903 0.0803 0.1540 0.1109 0.1094 0.1245 0.1001 0.1063 0.1201 0.1038 0.1194 0.0996 0.1698 0.0723
va: 2.2356 2.1598 2.1008 2.1346 2.8522 3.2154 3.5273 3.8928 3.8397 4.1316 3.9496 3.9580 3.9518 3.9043 4.1035 4.0835 3.6295 3.8810 3.8877 3.9827 3.9814 4.0336 3.9102 3.9131 1.0056 1.0065 1.0145 1.0009 1.0071 1.0160 1.0055 1.0015 1.0007 0.9957 1.0068 0.9997 1.0315 1.0177 1.0185 1.0023 0.9844 0.9860 0.9977 0.9856 0.9982 0.9841 1.0055 1.0069
dispcorr: -0.022264125 hartree
energy: -1110.852480463029
dipole: 21.99401 -23.76426 -1.77025 10.27596 -10.66502 -0.38906 -0.52274 0.66154 0.13880
magnitude: 1.81780 au
magnitude: 4.62049 debye
