program: Orca
programVersion: 5.0.2
elementType: O O O O N N C C C C C C C C C C C C C C C C C C H H H H H H H H H H H H H H H H H H H H H H H H
charge: 0
multiplicity: 1
keywords: wb97x-d3
keywords: def2-TZVPP
keywords: def2/J RIJCOSX
keywords: DEFGRID2
keywords: scfconv7
keywords: smallprint printgap noloewdin
keywords: NOSOSCF
formula: C18H24N2O4
InChI: InChI=1/C18H24N2O4/c1-6-18(3,7-2)14-11-15(24-20-14)19-17(21)16-12(22-4)9-8-10-13(16)23-5/h8-11,19H,6-7H2,1-5H3
48 atoms
O  1.168104 1.810547 1.693569
O  -3.163368 0.732841 2.126198
O  -2.525434 -2.142082 1.30707
O  -1.755838 1.875701 -0.839203
N  2.356149 1.576214 1.04768
N  -0.943478 0.999884 1.945581
C  3.245185 -0.05107 -0.555651
C  3.533606 -1.503531 -0.123532
C  2.716504 -0.086756 -2.004802
C  2.167763 0.512628 0.32598
C  4.518751 0.789236 -0.475212
C  3.994437 -1.683551 1.315366
C  2.326748 1.262285 -2.590893
C  0.853924 -0.003024 0.48788
C  0.286408 0.873979 1.354001
C  -2.162444 0.546449 1.486588
C  -2.14878 -0.162896 0.171358
C  -2.374679 -1.536106 0.120977
C  -1.955335 0.559414 -1.003837
C  -2.385385 -2.194356 -1.107979
C  -1.961816 -0.090991 -2.234768
C  -2.178257 -1.458797 -2.262694
C  -2.811127 -3.517798 1.339585
C  -1.513318 2.675718 -1.970535
H  2.633733 -2.104615 -0.287017
H  4.289484 -1.910024 -0.802857
H  3.48516 -0.549138 -2.631912
H  5.281196 0.366665 -1.132725
H  4.923649 0.822022 0.534631
H  4.347922 1.821905 -0.774332
H  4.941303 -1.181246 1.510894
H  3.262965 -1.297706 2.025789
H  4.139349 -2.741014 1.537512
H  3.180585 1.932003 -2.687344
H  1.900705 1.135719 -3.5868
H  1.582089 1.765532 -1.972875
H  -0.991184 1.57454 2.77585
H  -2.550253 -3.259847 -1.177928
H  -1.808062 0.444488 -3.160281
H  -2.186895 -1.969145 -3.216735
H  -2.934408 -3.780364 2.387253
H  -1.997894 -4.119108 0.921811
H  -3.736728 -3.75767 0.808566
H  -0.614289 2.362489 -2.50844
H  -2.360725 2.674834 -2.662096
H  -1.363679 3.687948 -1.603597
H  0.42637 -0.879857 0.037507
H  1.851035 -0.755127 -2.049109
totalener: -1110.82716129 hartree
nucrepener: 2236.64246677 hartree
electener: -3347.46962807 hartree
oneelecener: -5957.23503364 hartree
twoeener: 2609.76540557 hartree
kineticenergy: 1106.09560454 hartree
xcener: -106.824750211743 hartree
chargesum: -0.0000000
charge: -0.151833 -0.323913 -0.266827 -0.284787 -0.139584 -0.153968 0.436918 -0.167720 -0.149582 -0.157847 -0.345765 -0.265870 -0.292018 -0.283844 0.297115 0.267274 -0.220611 0.352563 0.399810 -0.261580 -0.272711 -0.105501 -0.151280 -0.148036 0.068316 0.077023 0.079220 0.092861 0.104543 0.102927 0.079147 0.092011 0.087065 0.091494 0.091450 0.079768 0.150169 0.110665 0.109133 0.124564 0.119530 0.098481 0.104428 0.085609 0.116146 0.123206 0.136092 0.065748
qa: -0.1518 -0.3239 -0.2668 -0.2848 -0.1396 -0.1540 0.4369 -0.1677 -0.1496 -0.1578 -0.3458 -0.2659 -0.2920 -0.2838 0.2971 0.2673 -0.2206 0.3526 0.3998 -0.2616 -0.2727 -0.1055 -0.1513 -0.1480 0.0683 0.0770 0.0792 0.0929 0.1045 0.1029 0.0791 0.0920 0.0871 0.0915 0.0914 0.0798 0.1502 0.1107 0.1091 0.1246 0.1195 0.0985 0.1044 0.0856 0.1161 0.1232 0.1361 0.0657
va: 2.2385 2.1926 2.1227 2.0991 2.8278 3.1809 3.5846 3.8638 3.8407 4.1129 3.9601 3.9583 3.9623 3.8687 4.0890 4.2814 3.5457 3.8851 3.7885 3.9724 3.9868 4.0170 3.9155 3.8972 1.0085 1.0086 1.0114 1.0002 1.0097 1.0087 1.0050 1.0006 1.0039 1.0076 1.0017 0.9904 1.0416 1.0179 1.0171 1.0014 0.9979 0.9840 0.9857 0.9849 0.9880 0.9975 0.9976 1.0140
dispcorr: -0.026770061 hartree
energy: -1110.853931354861
dipole: 24.35713 -24.17157 0.18556 -9.19269 7.95592 -1.23677 -16.52869 15.01805 -1.51063
magnitude: 1.96113 au
magnitude: 4.98480 debye
