program: Orca
programVersion: 5.0.2
elementType: F N N N N N C C C C C C C C C C C C C C C C H H H H H H H H H H H H H H H H H H H H
charge: 0
multiplicity: 1
keywords: wb97x-d3
keywords: def2-TZVPP
keywords: def2/J RIJCOSX
keywords: DEFGRID2
keywords: scfconv7
keywords: smallprint printgap noloewdin
keywords: NOSOSCF
formula: C16H20FN5
InChI: InChI=1/C16H20FN5/c1-8-4-5-11-7-9(2)13(12(11)6-8)19-16-21-14(10(3)17)20-15(18)22-16/h4-6,9-10,13,19H,7,18H2,1-3H3
42 atoms
F  5.573166 -1.033472 0.627572
N  -0.09384 0.080388 0.441381
N  2.056231 -0.652909 0.641068
N  1.51339 1.135511 -0.815915
N  3.741117 0.328105 -0.686198
N  3.182572 2.056694 -2.069289
C  -1.52347 2.088311 0.945208
C  -1.177328 0.924371 -0.018104
C  -2.617241 1.516753 1.869148
C  -2.456683 0.12981 -0.05643
C  -3.269119 0.461157 1.020545
C  -2.036431 3.288308 0.160988
C  -2.835368 -0.83142 -0.977477
C  -4.488092 -0.180675 1.176989
C  -4.062724 -1.478467 -0.83766
C  -4.873369 -1.141229 0.247848
C  1.186408 0.204602 0.07489
C  -4.505576 -2.493081 -1.85039
C  3.297564 -0.529245 0.210738
C  2.795556 1.151294 -1.170987
C  4.280399 -1.513426 0.791545
C  4.160774 -2.865701 0.124741
H  -0.638222 2.387449 1.509534
H  -0.903586 1.3043 -1.002175
H  -3.316226 2.28444 2.207247
H  -2.186668 1.069404 2.769926
H  -2.920818 3.037351 -0.429359
H  -1.276534 3.664485 -0.525844
H  -2.310569 4.10472 0.830434
H  -0.295925 -0.60613 1.152477
H  -2.184819 -1.07802 -1.809945
H  -5.141575 0.057563 2.00771
H  -3.704619 -3.1919 -2.093876
H  -5.358625 -3.070034 -1.495412
H  -4.802301 -2.012991 -2.785096
H  4.095781 -1.604941 1.864241
H  4.326812 -2.794872 -0.950899
H  3.166302 -3.277738 0.288942
H  4.883008 -3.565856 0.544857
H  4.131189 2.067174 -2.402163
H  2.51045 2.661245 -2.509072
H  -5.828633 -1.639445 0.366098
elementType: F N C H
totalener: -995.53172395 hartree
nucrepener: 1766.42367820 hartree
electener: -2761.95540215 hartree
oneelecener: -4863.58249118 hartree
twoeener: 2101.62708903 hartree
cpcmener: -0.03199299 hartree
kineticenergy: 991.22017432 hartree
xcener: -96.218541365257 hartree
chargesum: -0.0000000
charge: -0.264018 -0.183374 -0.463039 -0.448678 -0.421033 -0.254360 0.073034 0.208485 -0.084099 -0.093382 -0.091396 -0.334955 -0.229402 -0.199508 -0.024722 -0.134036 0.397297 -0.221565 0.265040 0.341729 0.180479 -0.269973 0.056517 0.095414 0.084602 0.091822 0.095146 0.089318 0.092343 0.161529 0.133552 0.146640 0.099384 0.093066 0.103292 0.080357 0.098267 0.094996 0.102608 0.194107 0.195888 0.142628
qa: -0.2640 -0.1834 -0.4630 -0.4487 -0.4210 -0.2544 0.0730 0.2085 -0.0841 -0.0934 -0.0914 -0.3350 -0.2294 -0.1995 -0.0247 -0.1340 0.3973 -0.2216 0.2650 0.3417 0.1805 -0.2700 0.0565 0.0954 0.0846 0.0918 0.0951 0.0893 0.0923 0.1615 0.1336 0.1466 0.0994 0.0931 0.1033 0.0804 0.0983 0.0950 0.1026 0.1941 0.1959 0.1426
va: 0.9941 3.2372 2.9866 2.9240 2.9922 3.2123 3.8536 3.6658 3.9469 3.6502 3.7869 3.9585 3.9872 3.9674 3.7564 3.8662 4.2032 3.9075 4.0101 4.3482 4.0184 3.8971 1.0204 1.0329 1.0076 1.0063 0.9963 1.0055 1.0043 1.0289 1.0097 0.9996 0.9971 1.0040 0.9929 1.0074 1.0091 1.0183 1.0064 1.0085 1.0062 0.9984
dispcorr: -0.018113549 hartree
energy: -995.549837499357
dipole: -22.70987 21.02755 -1.68232 0.41430 -0.08977 0.32453 -2.61697 2.16181 -0.45516
magnitude: 1.77276 au
magnitude: 4.50600 debye
