program: Orca
programVersion: 5.0.2
elementType: F N N N N N C C C C C C C C C C C C C C C C H H H H H H H H H H H H H H H H H H H H
charge: 0
multiplicity: 1
keywords: wb97x-d3
keywords: def2-TZVPP
keywords: def2/J RIJCOSX
keywords: DEFGRID2
keywords: scfconv7
keywords: smallprint printgap noloewdin
keywords: NOSOSCF
formula: C16H20FN5
InChI: InChI=1/C16H20FN5/c1-8-4-5-11-7-9(2)13(12(11)6-8)19-16-21-14(10(3)17)20-15(18)22-16/h4-6,9-10,13,19H,7,18H2,1-3H3
42 atoms
F  3.278916 1.708175 -1.868706
N  0.040557 0.16446 1.410009
N  1.689768 0.26754 -0.197757
N  1.772932 -1.300536 1.57573
N  3.518001 -1.211359 -0.028635
N  3.561616 -2.713522 1.692173
C  -1.499882 2.087574 1.759247
C  -0.840982 1.112785 0.755014
C  -2.839344 1.423101 2.13495
C  -2.029929 0.414149 0.138641
C  -3.15703 0.583438 0.930849
C  -1.727775 3.443265 1.103886
C  -2.073397 -0.349763 -1.017952
C  -4.353508 -0.013894 0.559874
C  -3.269327 -0.950749 -1.40552
C  -4.399377 -0.772159 -0.602509
C  1.191857 -0.301205 0.909903
C  -3.357678 -1.755263 -2.669393
C  2.841044 -0.235671 -0.599804
C  2.927877 -1.719082 1.070755
C  3.428099 0.322988 -1.869944
C  2.744699 -0.251638 -3.089257
H  -0.860874 2.220821 2.633725
H  -0.247869 1.650671 0.017625
H  -3.614901 2.157881 2.361299
H  -2.738651 0.792268 3.023476
H  -2.360379 3.359481 0.217275
H  -0.785037 3.898087 0.796035
H  -2.218017 4.131754 1.793178
H  -0.336293 -0.345782 2.195961
H  -1.184647 -0.478939 -1.626385
H  -5.245124 0.10594 1.163897
H  -3.885554 -1.206441 -3.452029
H  -2.369716 -2.004219 -3.055486
H  -3.901547 -2.687488 -2.512836
H  4.497332 0.105753 -1.894761
H  2.864776 -1.335119 -3.110515
H  3.18652 0.149741 -4.001412
H  1.677345 -0.028103 -3.089002
H  4.439456 -3.054548 1.340166
H  3.174395 -3.127217 2.522944
H  -5.333798 -1.236965 -0.896024
elementType: F N C H
totalener: -995.53025541 hartree
nucrepener: 1801.39438033 hartree
electener: -2796.92463574 hartree
oneelecener: -4933.91131640 hartree
twoeener: 2136.98668066 hartree
cpcmener: -0.03208704 hartree
kineticenergy: 991.21452411 hartree
xcener: -96.216286514479 hartree
chargesum: 0.0000000
charge: -0.269334 -0.199594 -0.438569 -0.443697 -0.422715 -0.248135 0.070258 0.244523 -0.098448 -0.096189 -0.124501 -0.332943 -0.207181 -0.178280 -0.008890 -0.166748 0.389181 -0.222741 0.229493 0.353819 0.189780 -0.273561 0.055030 0.096037 0.084220 0.093754 0.096622 0.089448 0.090421 0.163508 0.140543 0.145994 0.103097 0.092864 0.098998 0.079982 0.099461 0.104461 0.092316 0.193231 0.193628 0.140859
qa: -0.2693 -0.1996 -0.4386 -0.4437 -0.4227 -0.2481 0.0703 0.2445 -0.0984 -0.0962 -0.1245 -0.3329 -0.2072 -0.1783 -0.0089 -0.1667 0.3892 -0.2227 0.2295 0.3538 0.1898 -0.2736 0.0550 0.0960 0.0842 0.0938 0.0966 0.0894 0.0904 0.1635 0.1405 0.1460 0.1031 0.0929 0.0990 0.0800 0.0995 0.1045 0.0923 0.1932 0.1936 0.1409
va: 0.9883 3.2340 2.9772 2.9702 2.9936 3.2122 3.8647 3.6411 3.9349 3.6772 3.8104 3.9580 3.9472 3.9491 3.7514 3.9016 4.2179 3.9047 4.0710 4.3347 3.9648 3.9264 1.0235 1.0455 1.0067 1.0037 0.9956 1.0039 1.0048 1.0281 1.0103 0.9982 0.9931 1.0041 0.9975 1.0113 1.0112 1.0072 1.0113 1.0090 1.0083 0.9985
dispcorr: -0.018631852 hartree
energy: -995.548887259081
dipole: -17.16179 16.61667 -0.54513 0.97895 -2.39375 -1.41480 -3.38452 4.20489 0.82037
magnitude: 1.72390 au
magnitude: 4.38181 debye
