program: Orca
programVersion: 5.0.2
elementType: F N N N N N C C C C C C C C C C C C C C C C H H H H H H H H H H H H H H H H H H H H
charge: 0
multiplicity: 1
keywords: wb97x-d3
keywords: def2-TZVPP
keywords: def2/J RIJCOSX
keywords: DEFGRID2
keywords: scfconv7
keywords: smallprint printgap noloewdin
keywords: NOSOSCF
formula: C16H20FN5
InChI: InChI=1/C16H20FN5/c1-8-4-5-11-7-9(2)13(12(11)6-8)19-16-21-14(10(3)17)20-15(18)22-16/h4-6,9-10,13,19H,7,18H2,1-3H3
42 atoms
F  3.206541 1.598758 -1.968186
N  0.077552 0.261922 1.489826
N  1.649445 0.255184 -0.193979
N  1.778024 -1.245818 1.633351
N  3.444997 -1.26587 -0.055112
N  3.531985 -2.704295 1.717711
C  -1.535876 2.114132 1.829272
C  -0.813584 1.193267 0.820245
C  -2.842257 1.371184 2.172298
C  -1.961025 0.470114 0.153295
C  -3.105458 0.554694 0.939152
C  -1.826091 3.465582 1.191057
C  -1.959153 -0.240629 -1.034132
C  -4.265108 -0.084472 0.532738
C  -3.12274 -0.884868 -1.45925
C  -4.263544 -0.798021 -0.661769
C  1.19135 -0.257091 0.957051
C  -3.141752 -1.63748 -2.757654
C  2.76711 -0.293374 -0.629944
C  2.895789 -1.71537 1.09034
C  3.306358 0.209811 -1.943169
C  2.540815 -0.368976 -3.108493
H  -0.918403 2.267073 2.71589
H  -0.217147 1.770287 0.115838
H  -3.656282 2.058384 2.411717
H  -2.71685 0.721099 3.043467
H  -2.443752 3.363049 0.296309
H  -0.904703 3.971704 0.900107
H  -2.357749 4.118114 1.884442
H  -0.285647 -0.216488 2.301847
H  -1.062994 -0.297895 -1.642162
H  -5.168006 -0.031198 1.128895
H  -2.300477 -2.327591 -2.832074
H  -4.058386 -2.214879 -2.872771
H  -3.072613 -0.959344 -3.610175
H  4.364017 -0.045965 -2.018642
H  2.639434 -1.453705 -3.117415
H  2.935723 0.0073 -4.051967
H  1.480153 -0.125185 -3.050063
H  4.382472 -3.081988 1.337805
H  3.174006 -3.077538 2.579696
H  -5.170982 -1.295555 -0.983398
elementType: F N C H
totalener: -995.53020225 hartree
nucrepener: 1809.25121358 hartree
electener: -2804.78141583 hartree
oneelecener: -4949.63284068 hartree
twoeener: 2144.85142485 hartree
cpcmener: -0.03229092 hartree
kineticenergy: 991.22975003 hartree
xcener: -96.219284603129 hartree
chargesum: 0.0000000
charge: -0.269116 -0.205651 -0.440200 -0.442440 -0.421594 -0.247272 0.073475 0.262508 -0.103529 -0.107817 -0.132197 -0.331760 -0.196757 -0.178091 -0.024343 -0.153164 0.391240 -0.227157 0.229058 0.354297 0.190458 -0.274292 0.055154 0.095350 0.084638 0.094641 0.096256 0.089347 0.090409 0.163516 0.139334 0.145748 0.100964 0.091824 0.103516 0.079075 0.099544 0.105522 0.091702 0.193286 0.193320 0.141200
qa: -0.2691 -0.2057 -0.4402 -0.4424 -0.4216 -0.2473 0.0735 0.2625 -0.1035 -0.1078 -0.1322 -0.3318 -0.1968 -0.1781 -0.0243 -0.1532 0.3912 -0.2272 0.2291 0.3543 0.1905 -0.2743 0.0552 0.0954 0.0846 0.0946 0.0963 0.0893 0.0904 0.1635 0.1393 0.1457 0.1010 0.0918 0.1035 0.0791 0.0995 0.1055 0.0917 0.1933 0.1933 0.1412
va: 0.9883 3.2281 2.9751 2.9718 2.9969 3.2134 3.8625 3.6401 3.9380 3.6618 3.8053 3.9583 3.9354 3.9557 3.7787 3.8804 4.2146 3.9083 4.0711 4.3335 3.9671 3.9284 1.0231 1.0421 1.0071 1.0040 0.9958 1.0040 1.0049 1.0281 1.0090 0.9982 0.9960 1.0046 0.9931 1.0117 1.0111 1.0075 1.0094 1.0090 1.0085 0.9995
dispcorr: -0.018886439 hartree
energy: -995.549088687212
dipole: -17.23057 16.70951 -0.52106 1.15453 -2.52936 -1.37484 -3.18659 4.05658 0.86999
magnitude: 1.70838 au
magnitude: 4.34235 debye
