program: Orca
programVersion: 5.0.2
elementType: F N N N N N C C C C C C C C C C C C C C C C H H H H H H H H H H H H H H H H H H H H
charge: 0
multiplicity: 1
keywords: wb97x-d3
keywords: def2-TZVPP
keywords: def2/J RIJCOSX
keywords: DEFGRID2
keywords: scfconv7
keywords: smallprint printgap noloewdin
keywords: NOSOSCF
formula: C16H20FN5
InChI: InChI=1/C16H20FN5/c1-8-4-5-11-7-9(2)13(12(11)6-8)19-16-21-14(10(3)17)20-15(18)22-16/h4-6,9-10,13,19H,7,18H2,1-3H3
42 atoms
F  3.679083 -0.29717 -2.914049
N  -0.024491 0.060188 1.419492
N  1.506326 0.314028 -0.289901
N  1.746996 -1.365852 1.36226
N  3.375033 -1.122663 -0.345659
N  3.56532 -2.741488 1.253414
C  -1.650199 1.86483 1.945153
C  -0.992227 0.976677 0.870706
C  -3.022348 2.217218 1.347143
C  -2.176191 0.312142 0.210305
C  -3.335635 1.029965 0.481815
C  -0.815899 3.063417 2.351414
C  -2.204406 -0.829483 -0.569133
C  -4.544554 0.600678 -0.038379
C  -3.418101 -1.278393 -1.094533
C  -4.575349 -0.549496 -0.822162
C  1.100668 -0.341496 0.808906
C  -3.470754 -2.537433 -1.910173
C  2.641291 -0.128611 -0.799859
C  2.873646 -1.71938 0.750337
C  3.159623 0.619514 -1.999929
C  4.239715 1.603118 -1.611311
H  -1.825311 1.233018 2.824319
H  -0.475912 1.607311 0.143681
H  -2.949187 3.125353 0.738551
H  -3.776376 2.407726 2.112226
H  -0.628819 3.716776 1.496944
H  0.149884 2.762534 2.759687
H  -1.321159 3.653895 3.11694
H  -0.342153 -0.526863 2.177541
H  -1.294278 -1.386458 -0.767935
H  -5.46116 1.142024 0.163757
H  -3.424415 -3.422466 -1.272289
H  -4.39059 -2.602757 -2.49033
H  -2.6313 -2.600428 -2.602992
H  2.330093 1.136989 -2.484693
H  4.601582 2.141218 -2.487272
H  5.081788 1.099412 -1.136254
H  3.843496 2.337608 -0.910132
H  4.422919 -3.033819 0.818325
H  3.244851 -3.224202 2.074734
H  -5.521489 -0.890877 -1.225697
elementType: F N C H
totalener: -995.53374944 hartree
nucrepener: 1786.59536187 hartree
electener: -2782.12911131 hartree
oneelecener: -4904.01929863 hartree
twoeener: 2121.89018732 hartree
cpcmener: -0.03240906 hartree
kineticenergy: 991.21852015 hartree
xcener: -96.217525058617 hartree
chargesum: -0.0000000
charge: -0.268910 -0.198991 -0.432234 -0.441024 -0.423582 -0.249510 0.045337 0.244962 -0.092143 -0.083922 -0.137559 -0.319081 -0.212126 -0.164661 -0.024019 -0.143709 0.389721 -0.226392 0.246504 0.355073 0.177848 -0.273434 0.062825 0.085928 0.081087 0.089125 0.079149 0.088922 0.098652 0.158919 0.141889 0.145618 0.103090 0.092899 0.098479 0.080017 0.103379 0.093783 0.099512 0.194198 0.193685 0.140696
qa: -0.2689 -0.1990 -0.4322 -0.4410 -0.4236 -0.2495 0.0453 0.2450 -0.0921 -0.0839 -0.1376 -0.3191 -0.2121 -0.1647 -0.0240 -0.1437 0.3897 -0.2264 0.2465 0.3551 0.1778 -0.2734 0.0628 0.0859 0.0811 0.0891 0.0791 0.0889 0.0987 0.1589 0.1419 0.1456 0.1031 0.0929 0.0985 0.0800 0.1034 0.0938 0.0995 0.1942 0.1937 0.1407
va: 0.9891 3.2116 2.9726 2.9688 3.0001 3.2121 3.9034 3.7138 3.9272 3.7834 3.8327 3.9527 3.9614 3.9318 3.7851 3.8722 4.2080 3.9107 4.0268 4.3356 3.9848 3.9175 1.0236 1.0419 1.0071 1.0098 1.0042 1.0070 1.0004 1.0312 1.0119 0.9998 0.9926 1.0035 0.9978 1.0104 1.0066 1.0149 1.0113 1.0085 1.0085 0.9989
dispcorr: -0.018305079 hartree
energy: -995.552054518708
dipole: -13.51908 12.84935 -0.66973 8.74519 -8.64010 0.10509 5.91282 -4.35880 1.55402
magnitude: 1.69545 au
magnitude: 4.30950 debye
