program: Orca
programVersion: 5.0.2
elementType: F N N N N N C C C C C C C C C C C C C C C C H H H H H H H H H H H H H H H H H H H H
charge: 0
multiplicity: 1
keywords: wb97x-d3
keywords: def2-TZVPP
keywords: def2/J RIJCOSX
keywords: DEFGRID2
keywords: scfconv7
keywords: smallprint printgap noloewdin
keywords: NOSOSCF
formula: C16H20FN5
InChI: InChI=1/C16H20FN5/c1-8-4-5-11-7-9(2)13(12(11)6-8)19-16-21-14(10(3)17)20-15(18)22-16/h4-6,9-10,13,19H,7,18H2,1-3H3
42 atoms
F  3.889936 -0.215036 -2.81554
N  -0.049345 -0.025346 1.35266
N  1.518594 0.263732 -0.312031
N  1.756881 -1.409511 1.346374
N  3.429142 -1.118155 -0.312378
N  3.606545 -2.744125 1.283043
C  -1.601626 1.847087 1.8710
C  -0.996298 0.911783 0.806025
C  -2.96422 2.244139 1.280863
C  -2.215729 0.276428 0.182724
C  -3.341499 1.046965 0.455305
C  -0.711845 3.015934 2.243815
C  -2.303062 -0.883811 -0.563198
C  -4.576435 0.649449 -0.025808
C  -3.544845 -1.300317 -1.050541
C  -4.667684 -0.522143 -0.773069
C  1.101025 -0.399888 0.776262
C  -3.661242 -2.570451 -1.84128
C  2.681716 -0.143879 -0.785984
C  2.908989 -1.732467 0.766204
C  3.212072 0.64216 -1.955136
C  4.146068 1.737865 -1.492414
H  -1.792411 1.23983 2.764122
H  -0.4741 1.508644 0.055136
H  -2.857246 3.128952 0.643348
H  -3.698623 2.49252 2.048253
H  -0.496956 3.637568 1.372341
H  0.240145 2.682002 2.658893
H  -1.187735 3.648737 2.994243
H  -0.367665 -0.598971 2.120296
H  -1.418111 -1.479674 -0.764014
H  -5.467632 1.230121 0.180705
H  -4.669398 -2.709134 -2.229922
H  -2.973734 -2.579245 -2.688271
H  -3.421497 -3.442308 -1.229795
H  2.372535 1.067756 -2.507205
H  4.999029 1.329483 -0.949999
H  3.619187 2.422998 -0.828793
H  4.513637 2.314869 -2.340869
H  4.496603 -2.998612 0.891568
H  3.281689 -3.221081 2.106276
H  -5.635135 -0.841188 -1.142851
elementType: F N C H
totalener: -995.53368864 hartree
nucrepener: 1784.08909800 hartree
electener: -2779.62278664 hartree
oneelecener: -4898.97120276 hartree
twoeener: 2119.34841612 hartree
cpcmener: -0.03240182 hartree
kineticenergy: 991.22829626 hartree
xcener: -96.220221831821 hartree
chargesum: 0.0000000
charge: -0.266791 -0.196258 -0.436650 -0.443791 -0.421569 -0.249393 0.046105 0.229713 -0.092335 -0.078233 -0.132317 -0.319006 -0.208583 -0.169425 -0.029491 -0.138785 0.396181 -0.226270 0.243681 0.354939 0.178789 -0.274766 0.062347 0.086735 0.081322 0.089279 0.079184 0.088932 0.099244 0.159468 0.140155 0.145463 0.091173 0.101074 0.102927 0.080758 0.095428 0.098586 0.103743 0.194143 0.193517 0.140777
qa: -0.2668 -0.1963 -0.4367 -0.4438 -0.4216 -0.2494 0.0461 0.2297 -0.0923 -0.0782 -0.1323 -0.3190 -0.2086 -0.1694 -0.0295 -0.1388 0.3962 -0.2263 0.2437 0.3549 0.1788 -0.2748 0.0623 0.0867 0.0813 0.0893 0.0792 0.0889 0.0992 0.1595 0.1402 0.1455 0.0912 0.1011 0.1029 0.0808 0.0954 0.0986 0.1037 0.1941 0.1935 0.1408
va: 0.9914 3.2147 2.9644 2.9705 3.0010 3.2105 3.8994 3.7186 3.9256 3.7688 3.8250 3.9538 3.9641 3.9354 3.7882 3.8620 4.1998 3.9112 4.0306 4.3364 3.9902 3.9118 1.0235 1.0444 1.0074 1.0099 1.0042 1.0068 1.0002 1.0310 1.0116 1.0002 1.0048 0.9954 0.9936 1.0097 1.0134 1.0130 1.0064 1.0084 1.0085 0.9993
dispcorr: -0.018281057 hartree
energy: -995.551969693614
dipole: -14.28405 13.54003 -0.74402 8.92135 -8.77694 0.14440 5.85505 -4.30761 1.54744
magnitude: 1.72308 au
magnitude: 4.37971 debye
