program: Orca
programVersion: 5.0.2
elementType: F N N N N N C C C C C C C C C C C C C C C C H H H H H H H H H H H H H H H H H H H H
charge: 0
multiplicity: 1
keywords: wb97x-d3
keywords: def2-TZVPP
keywords: def2/J RIJCOSX
keywords: DEFGRID2
keywords: scfconv7
keywords: smallprint printgap noloewdin
keywords: NOSOSCF
formula: C16H20FN5
InChI: InChI=1/C16H20FN5/c1-8-4-5-11-7-9(2)13(12(11)6-8)19-16-21-14(10(3)17)20-15(18)22-16/h4-6,9-10,13,19H,7,18H2,1-3H3
42 atoms
F  4.265002 -0.002116 -2.587428
N  -0.10375 -0.191145 1.150864
N  1.608195 0.269772 -0.328012
N  1.755783 -1.489347 1.250713
N  3.553665 -1.060372 -0.236667
N  3.652053 -2.756542 1.291047
C  -1.496338 1.799432 1.697715
C  -1.024408 0.786468 0.634475
C  -2.886122 2.237834 1.209573
C  -2.318745 0.199119 0.129856
C  -3.380966 1.031974 0.461644
C  -0.516177 2.930227 1.934633
C  -2.517149 -0.97263 -0.577609
C  -4.666605 0.684421 0.082066
C  -3.808518 -1.338178 -0.961581
C  -4.86946 -0.497603 -0.623424
C  1.115236 -0.471934 0.674386
C  -4.051482 -2.625964 -1.692788
C  2.819961 -0.081533 -0.720722
C  2.964611 -1.744055 0.76199
C  3.421789 0.775539 -1.802486
C  4.204434 1.926655 -1.211561
H  -1.635938 1.24108 2.630813
H  -0.521617 1.315759 -0.178046
H  -2.800238 3.095661 0.53338
H  -3.54215 2.542607 2.026176
H  -0.376793 3.52377 1.028934
H  0.461659 2.551895 2.237899
H  -0.865058 3.600527 2.721353
H  -0.441082 -0.793527 1.88732
H  -1.6774 -1.611498 -0.831264
H  -5.510328 1.315954 0.333471
H  -4.143148 -3.462669 -0.996922
H  -4.970856 -2.589398 -2.276413
H  -3.23158 -2.86347 -2.370585
H  2.623007 1.150319 -2.444676
H  4.629739 2.546704 -2.000615
H  5.011989 1.569471 -0.572437
H  3.549907 2.557114 -0.611329
H  4.585403 -2.954128 0.974946
H  3.278768 -3.277298 2.065566
H  -5.875763 -0.774634 -0.915435
elementType: F N C H
totalener: -995.53350871 hartree
nucrepener: 1777.26580046 hartree
electener: -2772.79930916 hartree
oneelecener: -4885.28254103 hartree
twoeener: 2112.48323186 hartree
cpcmener: -0.03216190 hartree
kineticenergy: 991.23632043 hartree
xcener: -96.222326260807 hartree
chargesum: -0.0000000
charge: -0.265660 -0.191068 -0.441235 -0.447497 -0.418994 -0.249847 0.032470 0.218837 -0.076770 -0.091901 -0.099985 -0.316791 -0.215946 -0.183847 -0.020428 -0.139771 0.403654 -0.223069 0.246062 0.353322 0.176010 -0.273044 0.059572 0.086475 0.079971 0.088798 0.079129 0.089033 0.099145 0.160719 0.136484 0.145219 0.102967 0.094499 0.097141 0.081655 0.103605 0.096210 0.097185 0.193565 0.193466 0.140659
qa: -0.2657 -0.1911 -0.4412 -0.4475 -0.4190 -0.2498 0.0325 0.2188 -0.0768 -0.0919 -0.1000 -0.3168 -0.2159 -0.1838 -0.0204 -0.1398 0.4037 -0.2231 0.2461 0.3533 0.1760 -0.2730 0.0596 0.0865 0.0800 0.0888 0.0791 0.0890 0.0991 0.1607 0.1365 0.1452 0.1030 0.0945 0.0971 0.0817 0.1036 0.0962 0.0972 0.1936 0.1935 0.1407
va: 0.9924 3.2145 2.9635 2.9717 2.9974 3.2089 3.9123 3.7136 3.9166 3.7724 3.7971 3.9568 3.9832 3.9450 3.7633 3.8727 4.1934 3.9081 4.0292 4.3393 3.9969 3.9086 1.0256 1.0475 1.0081 1.0099 1.0039 1.0053 1.0007 1.0313 1.0121 1.0009 0.9924 1.0020 0.9995 1.0085 1.0064 1.0124 1.0139 1.0088 1.0086 0.9988
dispcorr: -0.018235396 hartree
energy: -995.551744103075
dipole: -15.33546 14.41792 -0.91754 8.64108 -8.55958 0.08150 5.58198 -4.11246 1.46952
magnitude: 1.73436 au
magnitude: 4.40839 debye
