program: Orca
programVersion: 5.0.2
elementType: F N N N N N C C C C C C C C C C C C C C C C H H H H H H H H H H H H H H H H H H H H
charge: 0
multiplicity: 1
keywords: wb97x-d3
keywords: def2-TZVPP
keywords: def2/J RIJCOSX
keywords: DEFGRID2
keywords: scfconv7
keywords: smallprint printgap noloewdin
keywords: NOSOSCF
formula: C16H20FN5
InChI: InChI=1/C16H20FN5/c1-8-4-5-11-7-9(2)13(12(11)6-8)19-16-21-14(10(3)17)20-15(18)22-16/h4-6,9-10,13,19H,7,18H2,1-3H3
42 atoms
F  4.624801 0.406344 -2.251773
N  -0.181647 -0.448548 0.809497
N  1.655452 0.272869 -0.391271
N  1.775586 -1.563535 1.10019
N  3.699627 -0.868358 -0.101194
N  3.768842 -2.652795 1.321679
C  -1.372895 1.681962 1.387929
C  -1.080543 0.57719 0.349501
C  -2.747343 2.223416 0.966529
C  -2.460996 0.062832 0.020563
C  -3.412689 1.017376 0.367979
C  -0.285588 2.729268 1.508238
C  -2.830948 -1.141801 -0.548265
C  -4.753663 0.763955 0.139491
C  -4.182577 -1.413857 -0.77726
C  -5.127792 -0.450455 -0.42913
C  1.115996 -0.572696 0.499829
C  -4.601896 -2.730086 -1.363051
C  2.939243 0.065815 -0.629556
C  3.056544 -1.673544 0.764761
C  3.590367 1.043673 -1.572459
C  4.142563 2.237112 -0.826918
H  -1.500067 1.181828 2.355197
H  -0.641156 1.02845 -0.543907
H  -2.633959 3.011558 0.213367
H  -3.302557 2.657789 1.799305
H  0.658337 2.292422 1.838531
H  -0.559016 3.496284 2.234693
H  -0.108703 3.225445 0.551714
H  -0.529681 -1.075675 1.519873
H  -2.084309 -1.882706 -0.812956
H  -5.510535 1.491743 0.406688
H  -4.474095 -3.542145 -0.644384
H  -5.649823 -2.720299 -1.660699
H  -4.007545 -2.986963 -2.240626
H  2.856815 1.366399 -2.314088
H  4.890075 1.935857 -0.09231
H  3.340686 2.755599 -0.301768
H  4.596527 2.946193 -1.519387
H  4.745945 -2.754151 1.108649
H  3.350918 -3.272582 1.993545
H  -6.178317 -0.654704 -0.599991
elementType: F N C H
totalener: -995.53345586 hartree
nucrepener: 1773.79760218 hartree
electener: -2769.33105804 hartree
oneelecener: -4878.29711824 hartree
twoeener: 2108.96606020 hartree
cpcmener: -0.03203089 hartree
kineticenergy: 991.21096892 hartree
xcener: -96.218077019146 hartree
chargesum: 0.0000000
charge: -0.266372 -0.196963 -0.443837 -0.447145 -0.418276 -0.248857 0.051625 0.203047 -0.088207 -0.078785 -0.084434 -0.327155 -0.223324 -0.181604 -0.019462 -0.139432 0.404064 -0.220849 0.244370 0.352843 0.177154 -0.269964 0.058109 0.086241 0.081018 0.088281 0.089124 0.099848 0.080582 0.163468 0.130048 0.145155 0.102942 0.091358 0.099783 0.081693 0.096064 0.095349 0.103451 0.193799 0.193364 0.141888
qa: -0.2664 -0.1970 -0.4438 -0.4471 -0.4183 -0.2489 0.0516 0.2030 -0.0882 -0.0788 -0.0844 -0.3272 -0.2233 -0.1816 -0.0195 -0.1394 0.4041 -0.2208 0.2444 0.3528 0.1772 -0.2700 0.0581 0.0862 0.0810 0.0883 0.0891 0.0998 0.0806 0.1635 0.1300 0.1452 0.1029 0.0914 0.0998 0.0817 0.0961 0.0953 0.1035 0.1938 0.1934 0.1419
va: 0.9918 3.2063 2.9639 2.9782 2.9962 3.2102 3.8819 3.7256 3.9395 3.7477 3.7866 3.9589 3.9956 3.9405 3.7664 3.8710 4.1969 3.9088 4.0338 4.3413 3.9973 3.9113 1.0261 1.0431 1.0072 1.0108 1.0045 1.0026 1.0033 1.0298 1.0184 1.0010 0.9930 1.0046 0.9965 1.0080 1.0124 1.0121 1.0067 1.0087 1.0085 0.9988
dispcorr: -0.018515688 hartree
energy: -995.551971550732
dipole: -16.70045 15.64571 -1.05474 7.82446 -7.87027 -0.04581 5.35542 -3.97671 1.37871
magnitude: 1.73650 au
magnitude: 4.41383 debye
