program: Orca
programVersion: 5.0.2
elementType: F N N N N N C C C C C C C C C C C C C C C C H H H H H H H H H H H H H H H H H H H H
charge: 0
multiplicity: 1
keywords: wb97x-d3
keywords: def2-TZVPP
keywords: def2/J RIJCOSX
keywords: DEFGRID2
keywords: scfconv7
keywords: smallprint printgap noloewdin
keywords: NOSOSCF
formula: C16H20FN5
InChI: InChI=1/C16H20FN5/c1-8-4-5-11-7-9(2)13(12(11)6-8)19-16-21-14(10(3)17)20-15(18)22-16/h4-6,9-10,13,19H,7,18H2,1-3H3
42 atoms
F  3.264893 1.916187 -1.684866
N  0.001398 -0.053933 1.355424
N  1.646247 0.246543 -0.235923
N  1.82623 -1.402616 1.455031
N  3.569704 -1.113241 -0.125738
N  3.695541 -2.711985 1.501647
C  -1.563621 1.804035 1.865101
C  -0.930739 0.89031 0.794723
C  -2.931604 2.182494 1.276666
C  -2.134104 0.260581 0.133425
C  -3.273888 1.001763 0.414855
C  -0.702213 2.987587 2.258217
C  -2.192979 -0.871751 -0.66244
C  -4.498018 0.603231 -0.099506
C  -3.417926 -1.285055 -1.185482
C  -4.559772 -0.535707 -0.892578
C  1.183471 -0.410834 0.836325
C  -3.522222 -2.520299 -2.031816
C  2.835211 -0.152316 -0.647905
C  3.006742 -1.719934 0.9370
C  3.407892 0.54069 -1.856338
C  2.711623 0.122286 -3.12898
H  -1.74599 1.182555 2.750081
H  -0.389536 1.498078 0.066056
H  -2.844772 3.087183 0.66477
H  -3.676181 2.390387 2.046395
H  -1.196365 3.597243 3.015957
H  -0.500508 3.627384 1.396915
H  0.256125 2.670873 2.671778
H  -0.326937 -0.612785 2.129522
H  -1.296122 -1.444651 -0.874634
H  -5.399889 1.163779 0.116064
H  -4.099624 -2.334867 -2.938318
H  -2.540416 -2.886147 -2.329785
H  -4.024066 -3.327842 -1.495268
H  4.475463 0.324878 -1.916699
H  1.649754 0.365014 -3.098335
H  2.811134 -0.95327 -3.273537
H  3.160338 0.616912 -3.990409
H  4.618302 -2.937089 1.172768
H  3.353318 -3.15953 2.334248
H  -5.516201 -0.854011 -1.291503
elementType: F N C H
totalener: -995.53352494 hartree
nucrepener: 1793.63785074 hartree
electener: -2789.17137568 hartree
oneelecener: -4918.34175864 hartree
twoeener: 2129.17038296 hartree
cpcmener: -0.03205737 hartree
kineticenergy: 991.22934250 hartree
xcener: -96.219517282697 hartree
chargesum: 0.0000000
charge: -0.269207 -0.189868 -0.431474 -0.444305 -0.416456 -0.249920 0.034426 0.236792 -0.082303 -0.090163 -0.116052 -0.317928 -0.223046 -0.167269 -0.009962 -0.158063 0.395365 -0.224168 0.232237 0.356974 0.179608 -0.270088 0.062280 0.084686 0.080279 0.088920 0.099036 0.079138 0.089349 0.158003 0.141377 0.145408 0.099378 0.092022 0.102749 0.078716 0.092997 0.099955 0.102187 0.193903 0.193654 0.140834
qa: -0.2692 -0.1899 -0.4315 -0.4443 -0.4165 -0.2499 0.0344 0.2368 -0.0823 -0.0902 -0.1161 -0.3179 -0.2230 -0.1673 -0.0100 -0.1581 0.3954 -0.2242 0.2322 0.3570 0.1796 -0.2701 0.0623 0.0847 0.0803 0.0889 0.0990 0.0791 0.0893 0.1580 0.1414 0.1454 0.0994 0.0920 0.1027 0.0787 0.0930 0.1000 0.1022 0.1939 0.1937 0.1408
va: 0.9875 3.2095 2.9811 2.9721 3.0011 3.2139 3.9151 3.7105 3.9185 3.7839 3.8158 3.9539 3.9781 3.9321 3.7603 3.8945 4.1994 3.9073 4.0625 4.3294 3.9644 3.9257 1.0241 1.0443 1.0076 1.0097 1.0002 1.0041 1.0063 1.0327 1.0114 1.0002 0.9971 1.0046 0.9934 1.0126 1.0151 1.0097 1.0068 1.0086 1.0082 0.9981
dispcorr: -0.018344512 hartree
energy: -995.551869454408
dipole: -15.37664 14.95471 -0.42192 -0.07375 -1.31938 -1.39312 -0.88203 1.66114 0.77911
magnitude: 1.65100 au
magnitude: 4.19652 debye
