program: Orca
programVersion: 5.0.2
elementType: F N N N N N C C C C C C C C C C C C C C C C H H H H H H H H H H H H H H H H H H H H
charge: 0
multiplicity: 1
keywords: wb97x-d3
keywords: def2-TZVPP
keywords: def2/J RIJCOSX
keywords: DEFGRID2
keywords: scfconv7
keywords: smallprint printgap noloewdin
keywords: NOSOSCF
formula: C16H20FN5
InChI: InChI=1/C16H20FN5/c1-8-4-5-11-7-9(2)13(12(11)6-8)19-16-21-14(10(3)17)20-15(18)22-16/h4-6,9-10,13,19H,7,18H2,1-3H3
42 atoms
F  5.486116 -1.06635 0.390154
N  -0.126758 -0.139393 0.580667
N  2.026435 -0.850213 0.382695
N  1.348262 1.215554 -0.556599
N  3.590383 0.473284 -0.784849
N  2.897931 2.462994 -1.669932
C  -1.616071 1.387817 1.886227
C  -1.242989 0.766268 0.523085
C  -3.108994 1.721261 1.742999
C  -2.532479 0.117659 0.08642
C  -3.600226 0.675297 0.783417
C  -0.738458 2.554044 2.294864
C  -2.733014 -0.86536 -0.864464
C  -4.88813 0.239779 0.526982
C  -4.028364 -1.316815 -1.13112
C  -5.091274 -0.754569 -0.426686
C  1.107824 0.099717 0.120782
C  -4.258486 -2.38638 -2.158644
C  3.225343 -0.5946 -0.101702
C  2.600971 1.3587 -0.985604
C  4.261344 -1.665946 0.112673
C  4.401077 -2.544082 -1.108948
H  -1.526637 0.591075 2.634118
H  -0.984463 1.561582 -0.180025
H  -3.236982 2.721862 1.314833
H  -3.635023 1.715193 2.698761
H  -1.044891 2.958672 3.260571
H  -0.793326 3.362411 1.56282
H  0.307501 2.256067 2.386639
H  -0.240536 -0.976594 1.132945
H  -1.894506 -1.294865 -1.4021
H  -5.732368 0.654983 1.06423
H  -3.949954 -2.055865 -3.1520
H  -3.685864 -3.287175 -1.932693
H  -5.309366 -2.66721 -2.216706
H  3.981282 -2.264351 0.980898
H  3.450944 -3.028111 -1.333552
H  5.139297 -3.327263 -0.936913
H  4.701648 -1.964482 -1.981841
H  3.828953 2.60943 -2.018882
H  2.191716 3.154151 -1.854527
H  -6.098076 -1.104499 -0.621937
elementType: F N C H
totalener: -995.53371974 hartree
nucrepener: 1765.08071012 hartree
electener: -2760.61442986 hartree
oneelecener: -4860.81568648 hartree
twoeener: 2100.20125662 hartree
cpcmener: -0.03206080 hartree
kineticenergy: 991.23077487 hartree
xcener: -96.221118719849 hartree
chargesum: -0.0000000
charge: -0.267462 -0.194973 -0.447933 -0.439250 -0.428118 -0.252133 0.044217 0.201591 -0.081803 -0.079484 -0.090219 -0.322102 -0.220049 -0.182963 -0.023335 -0.138547 0.411654 -0.221193 0.261863 0.342350 0.174172 -0.271719 0.059772 0.086922 0.080630 0.088552 0.099961 0.080480 0.089601 0.162683 0.130149 0.144894 0.102264 0.101453 0.090685 0.079841 0.098661 0.102956 0.094279 0.193361 0.195635 0.142657
qa: -0.2675 -0.1950 -0.4479 -0.4392 -0.4281 -0.2521 0.0442 0.2016 -0.0818 -0.0795 -0.0902 -0.3221 -0.2200 -0.1830 -0.0233 -0.1385 0.4117 -0.2212 0.2619 0.3423 0.1742 -0.2717 0.0598 0.0869 0.0806 0.0886 0.1000 0.0805 0.0896 0.1627 0.1301 0.1449 0.1023 0.1015 0.0907 0.0798 0.0987 0.1030 0.0943 0.1934 0.1956 0.1427
va: 0.9905 3.2059 3.0086 2.9296 2.9980 3.2155 3.8969 3.7407 3.9291 3.7527 3.7919 3.9567 3.9930 3.9416 3.7719 3.8675 4.1786 3.9097 4.0230 4.3430 3.9941 3.9136 1.0256 1.0442 1.0076 1.0105 1.0013 1.0036 1.0041 1.0301 1.0178 1.0012 0.9938 0.9950 1.0052 1.0115 1.0122 1.0068 1.0150 1.0091 1.0065 0.9989
dispcorr: -0.018164313 hartree
energy: -995.551884049714
dipole: -19.06784 17.49624 -1.57160 0.10203 0.36809 0.47012 -0.56043 0.18722 -0.37320
magnitude: 1.68233 au
magnitude: 4.27614 debye
