program: Orca
programVersion: 5.0.2
elementType: F N N N N N C C C C C C C C C C C C C C C C H H H H H H H H H H H H H H H H H H H H
charge: 0
multiplicity: 1
keywords: wb97x-d3
keywords: def2-TZVPP
keywords: def2/J RIJCOSX
keywords: DEFGRID2
keywords: scfconv7
keywords: smallprint printgap noloewdin
keywords: NOSOSCF
formula: C16H20FN5
InChI: InChI=1/C16H20FN5/c1-8-4-5-11-7-9(2)13(12(11)6-8)19-16-21-14(10(3)17)20-15(18)22-16/h4-6,9-10,13,19H,7,18H2,1-3H3
42 atoms
F  4.448514 0.321604 -2.417587
N  -0.187229 -0.392646 0.835129
N  1.649724 0.314979 -0.379093
N  1.763649 -1.511449 1.125667
N  3.682724 -0.847977 -0.097349
N  3.748303 -2.611912 1.354708
C  -1.41054 1.709695 1.427664
C  -1.096304 0.623808 0.373944
C  -2.8171 2.200658 1.053861
C  -2.463616 0.083963 0.032423
C  -3.443901 0.989642 0.426121
C  -0.362909 2.800306 1.521807
C  -2.797547 -1.106985 -0.586349
C  -4.778211 0.69667 0.20468
C  -4.140976 -1.416364 -0.814249
C  -5.115688 -0.505023 -0.411502
C  1.108027 -0.521102 0.519918
C  -4.52116 -2.718262 -1.457392
C  2.928428 0.090923 -0.628321
C  3.040798 -1.63701 0.782569
C  3.591803 1.041881 -1.590705
C  4.382609 2.10325 -0.860556
H  -1.485761 1.199574 2.394839
H  -0.654157 1.088746 -0.510847
H  -2.756605 3.01796 0.326474
H  -3.371953 2.580838 1.912795
H  0.606388 2.401028 1.823971
H  -0.64733 3.554695 2.256721
H  -0.2331 3.304208 0.561844
H  -0.52704 -1.019153 1.55002
H  -2.027597 -1.806961 -0.892437
H  -5.556048 1.385383 0.51199
H  -3.903626 -2.929523 -2.330858
H  -4.391585 -3.553916 -0.766649
H  -5.5629 -2.717879 -1.776114
H  2.8301 1.501009 -2.222159
H  3.73046 2.671365 -0.197698
H  4.830556 2.802133 -1.567049
H  5.175415 1.659202 -0.257824
H  4.707175 -2.761143 1.093499
H  3.306862 -3.252512 1.991118
H  -6.160076 -0.740925 -0.579278
elementType: F N C H
totalener: -995.53313594 hartree
nucrepener: 1771.84158774 hartree
electener: -2767.37472368 hartree
oneelecener: -4874.39382054 hartree
twoeener: 2107.01909686 hartree
cpcmener: -0.03177108 hartree
kineticenergy: 991.22142717 hartree
xcener: -96.218936639240 hartree
chargesum: -0.0000000
charge: -0.267099 -0.193966 -0.437375 -0.447123 -0.422537 -0.250536 0.042534 0.210254 -0.077554 -0.093220 -0.078786 -0.323577 -0.223962 -0.185414 -0.020649 -0.137666 0.407998 -0.221021 0.246960 0.352421 0.172706 -0.272470 0.058119 0.086481 0.080442 0.088387 0.088329 0.099468 0.080731 0.162593 0.130673 0.145340 0.099354 0.103065 0.091709 0.080939 0.098642 0.103236 0.093829 0.193507 0.193368 0.141871
qa: -0.2671 -0.1940 -0.4374 -0.4471 -0.4225 -0.2505 0.0425 0.2103 -0.0776 -0.0932 -0.0788 -0.3236 -0.2240 -0.1854 -0.0206 -0.1377 0.4080 -0.2210 0.2470 0.3524 0.1727 -0.2725 0.0581 0.0865 0.0804 0.0884 0.0883 0.0995 0.0807 0.1626 0.1307 0.1453 0.0994 0.1031 0.0917 0.0809 0.0986 0.1032 0.0938 0.1935 0.1934 0.1419
va: 0.9905 3.2086 2.9732 2.9768 2.9995 3.2099 3.8937 3.7242 3.9295 3.7549 3.7807 3.9606 3.9955 3.9438 3.7644 3.8706 4.1871 3.9090 4.0313 4.3396 3.9872 3.9185 1.0269 1.0420 1.0073 1.0105 1.0051 1.0019 1.0031 1.0305 1.0173 1.0011 0.9969 0.9929 1.0043 1.0100 1.0106 1.0067 1.0154 1.0089 1.0087 0.9989
dispcorr: -0.018354640 hartree
energy: -995.551490578772
dipole: -15.80042 14.81904 -0.98138 7.71067 -7.77197 -0.06130 5.54369 -4.12556 1.41813
magnitude: 1.72568 au
magnitude: 4.38632 debye
