program: Orca
programVersion: 5.0.2
elementType: F N N N N N C C C C C C C C C C C C C C C C H H H H H H H H H H H H H H H H H H H H
charge: 0
multiplicity: 1
keywords: wb97x-d3
keywords: def2-TZVPP
keywords: def2/J RIJCOSX
keywords: DEFGRID2
keywords: scfconv7
keywords: smallprint printgap noloewdin
keywords: NOSOSCF
formula: C16H20FN5
InChI: InChI=1/C16H20FN5/c1-8-4-5-11-7-9(2)13(12(11)6-8)19-16-21-14(10(3)17)20-15(18)22-16/h4-6,9-10,13,19H,7,18H2,1-3H3
42 atoms
F  0.571788 -0.301354 2.655326
N  0.299899 0.66081 -1.986373
N  1.041924 0.010947 0.094027
N  2.150892 -0.664743 -1.886606
N  2.887716 -1.447561 0.2267
N  3.9820 -2.0160 -1.69748
C  -0.733709 2.571526 -0.682724
C  -0.918603 1.273663 -1.503907
C  -1.943537 2.606409 0.27003
C  -1.777993 0.405151 -0.619079
C  -2.348909 1.165292 0.393468
C  -0.5928 3.814116 -1.541414
C  -2.03626 -0.948727 -0.729471
C  -3.176354 0.557684 1.323323
C  -2.862591 -1.576547 0.203989
C  -3.421267 -0.808748 1.225981
C  1.184703 -0.015448 -1.238902
C  -3.11377 -3.053848 0.120792
C  1.909247 -0.731388 0.748364
C  2.981438 -1.356483 -1.110814
C  1.819668 -0.7599 2.252497
C  2.889941 0.098235 2.886944
H  0.167845 2.45286 -0.078608
H  -1.485164 1.514086 -2.409371
H  -2.759477 3.194168 -0.16526
H  -1.704015 3.069945 1.228663
H  -0.457313 4.705627 -0.92704
H  -1.481185 3.968526 -2.157613
H  0.267889 3.748455 -2.209069
H  0.418367 0.584147 -2.983194
H  -1.584583 -1.533964 -1.523937
H  -3.623757 1.130686 2.126933
H  -3.941476 -3.357863 0.760658
H  -3.346537 -3.364831 -0.898211
H  -2.234975 -3.622318 0.432563
H  1.91492 -1.79462 2.589202
H  2.79401 0.085791 3.972683
H  2.825566 1.130392 2.540988
H  3.878181 -0.284191 2.638011
H  4.593329 -2.596928 -1.150776
H  4.062909 -2.03396 -2.699157
H  -4.059385 -1.287968 1.959265
elementType: F N C H
totalener: -995.52897663 hartree
nucrepener: 1870.28601702 hartree
electener: -2865.81499365 hartree
oneelecener: -5072.91626805 hartree
twoeener: 2207.10127440 hartree
cpcmener: -0.03620183 hartree
kineticenergy: 991.22252127 hartree
xcener: -96.221966439332 hartree
chargesum: 0.0000000
charge: -0.264069 -0.214714 -0.420852 -0.437124 -0.442330 -0.252779 -0.055605 0.344320 -0.060930 -0.075776 -0.128212 -0.312521 -0.263793 -0.190057 -0.008887 -0.149451 0.399065 -0.222724 0.237528 0.347820 0.190688 -0.272971 0.077419 0.099092 0.080464 0.087944 0.096763 0.077387 0.089834 0.167943 0.128971 0.144550 0.092106 0.099603 0.102472 0.084534 0.102421 0.099984 0.094881 0.192645 0.192739 0.141622
qa: -0.2641 -0.2147 -0.4209 -0.4371 -0.4423 -0.2528 -0.0556 0.3443 -0.0609 -0.0758 -0.1282 -0.3125 -0.2638 -0.1901 -0.0089 -0.1495 0.3991 -0.2227 0.2375 0.3478 0.1907 -0.2730 0.0774 0.0991 0.0805 0.0879 0.0968 0.0774 0.0898 0.1679 0.1290 0.1445 0.0921 0.0996 0.1025 0.0845 0.1024 0.1000 0.0949 0.1926 0.1927 0.1416
va: 0.9929 3.2167 2.9392 2.9933 2.9759 3.2071 3.9170 3.6078 3.8984 3.6404 3.7970 3.9625 3.9742 3.9518 3.7470 3.8782 4.1813 3.9096 4.0380 4.3443 3.9766 3.9108 1.0354 1.0007 1.0076 1.0093 1.0006 1.0034 1.0057 1.0217 1.0149 1.0004 1.0040 0.9973 0.9930 1.0067 1.0059 1.0062 1.0188 1.0093 1.0090 0.9994
dispcorr: -0.020236651 hartree
energy: -995.549213277615
dipole: -6.13174 7.09270 0.96095 6.17608 -6.45774 -0.28166 -1.62445 0.25016 -1.37428
magnitude: 1.70042 au
magnitude: 4.32212 debye
