program: Orca
programVersion: 5.0.2
elementType: F N N N N N C C C C C C C C C C C C C C C C H H H H H H H H H H H H H H H H H H H H
charge: 0
multiplicity: 1
keywords: wb97x-d3
keywords: def2-TZVPP
keywords: def2/J RIJCOSX
keywords: DEFGRID2
keywords: scfconv7
keywords: smallprint printgap noloewdin
keywords: NOSOSCF
formula: C16H20FN5
InChI: InChI=1/C16H20FN5/c1-8-4-5-11-7-9(2)13(12(11)6-8)19-16-21-14(10(3)17)20-15(18)22-16/h4-6,9-10,13,19H,7,18H2,1-3H3
42 atoms
F  3.228682 2.04321 -1.577223
N  -0.045391 -0.183891 1.241675
N  1.683486 0.268569 -0.215881
N  1.834189 -1.449452 1.407918
N  3.64451 -1.031997 -0.066753
N  3.745136 -2.694013 1.498678
C  -1.497374 1.76962 1.754689
C  -0.955952 0.787565 0.695966
C  -2.86595 2.199881 1.203503
C  -2.212461 0.196577 0.106017
C  -3.302014 1.007127 0.400077
C  -0.54802 2.909369 2.064578
C  -2.356823 -0.958314 -0.642416
C  -4.562031 0.651333 -0.052821
C  -3.61941 -1.325949 -1.109467
C  -4.710444 -0.512249 -0.799784
C  1.186274 -0.458085 0.794672
C  -3.798218 -2.556507 -1.949129
C  2.903827 -0.071904 -0.582652
C  3.051166 -1.7023 0.939689
C  3.508607 0.687239 -1.734031
C  2.957435 0.211896 -3.057315
H  -1.676327 1.190014 2.66818
H  -0.419294 1.342619 -0.076608
H  -2.756248 3.075162 0.553372
H  -3.569378 2.475817 1.990515
H  -0.94587 3.556955 2.847037
H  -0.374272 3.524401 1.179296
H  0.419749 2.539373 2.407733
H  -0.390345 -0.768633 1.988754
H  -1.496937 -1.582517 -0.862847
H  -5.427716 1.261192 0.176489
H  -3.037537 -3.305656 -1.730861
H  -4.775434 -3.012743 -1.792025
H  -3.722021 -2.320466 -3.012768
H  4.593103 0.570237 -1.708538
H  1.878448 0.354393 -3.112216
H  3.166771 -0.849359 -3.190089
H  3.425544 0.74844 -3.882693
H  4.690466 -2.875556 1.208629
H  3.376428 -3.18908 2.292074
H  -5.696901 -0.797588 -1.1465
elementType: F N C H
totalener: -995.53332906 hartree
nucrepener: 1789.72221814 hartree
electener: -2785.25554720 hartree
oneelecener: -4910.51755112 hartree
twoeener: 2125.26200391 hartree
cpcmener: -0.03179133 hartree
kineticenergy: 991.23366542 hartree
xcener: -96.221113291519 hartree
chargesum: 0.0000000
charge: -0.268789 -0.188360 -0.431805 -0.446073 -0.420393 -0.250502 0.034002 0.219371 -0.078848 -0.092229 -0.104639 -0.316642 -0.216717 -0.177790 -0.016597 -0.145704 0.400830 -0.221067 0.233927 0.355967 0.180895 -0.272898 0.060777 0.085947 0.080066 0.088959 0.099258 0.078847 0.088915 0.159821 0.137127 0.145251 0.095177 0.096080 0.102882 0.079934 0.095114 0.099463 0.102628 0.193732 0.193882 0.140204
qa: -0.2688 -0.1884 -0.4318 -0.4461 -0.4204 -0.2505 0.0340 0.2194 -0.0788 -0.0922 -0.1046 -0.3166 -0.2167 -0.1778 -0.0166 -0.1457 0.4008 -0.2211 0.2339 0.3560 0.1809 -0.2729 0.0608 0.0859 0.0801 0.0890 0.0993 0.0788 0.0889 0.1598 0.1371 0.1453 0.0952 0.0961 0.1029 0.0799 0.0951 0.0995 0.1026 0.1937 0.1939 0.1402
va: 0.9884 3.2112 2.9777 2.9747 2.9939 3.2132 3.9138 3.7151 3.9158 3.7758 3.8021 3.9562 3.9827 3.9392 3.7614 3.8789 4.1933 3.9064 4.0624 4.3322 3.9669 3.9229 1.0248 1.0479 1.0082 1.0097 1.0007 1.0041 1.0053 1.0317 1.0127 1.0007 1.0013 1.0007 0.9927 1.0114 1.0138 1.0111 1.0065 1.0087 1.0082 0.9989
dispcorr: -0.018288471 hartree
energy: -995.551617528558
dipole: -14.79897 14.49448 -0.30449 -0.31240 -1.08570 -1.39810 -1.36297 2.05623 0.69325
magnitude: 1.58996 au
magnitude: 4.04137 debye
