program: Orca
programVersion: 5.0.2
elementType: F N N N N N C C C C C C C C C C C C C C C C H H H H H H H H H H H H H H H H H H H H
charge: 0
multiplicity: 1
keywords: wb97x-d3
keywords: def2-TZVPP
keywords: def2/J RIJCOSX
keywords: DEFGRID2
keywords: scfconv7
keywords: smallprint printgap noloewdin
keywords: NOSOSCF
formula: C16H20FN5
InChI: InChI=1/C16H20FN5/c1-8-4-5-11-7-9(2)13(12(11)6-8)19-16-21-14(10(3)17)20-15(18)22-16/h4-6,9-10,13,19H,7,18H2,1-3H3
42 atoms
F  2.887482 1.193241 -2.571236
N  -0.161781 -0.441666 0.863297
N  1.699919 0.341433 -0.259475
N  1.796725 -1.546736 1.166411
N  3.743988 -0.788376 0.046534
N  3.79621 -2.615932 1.418692
C  -1.379839 1.637485 1.548693
C  -1.055289 0.606294 0.444396
C  -2.771941 2.165412 1.169949
C  -2.420292 0.100085 0.049092
C  -3.399031 0.995919 0.467965
C  -0.323811 2.709894 1.724956
C  -2.752931 -1.055711 -0.633518
C  -4.731465 0.727648 0.207099
C  -4.093916 -1.338392 -0.904568
C  -5.067954 -0.438878 -0.473915
C  1.144231 -0.540639 0.58034
C  -4.46946 -2.579949 -1.659852
C  2.992071 0.156325 -0.474897
C  3.086001 -1.631379 0.866921
C  3.647569 1.159041 -1.397946
C  5.084756 0.882766 -1.749289
H  -1.48327 1.07706 2.484944
H  -0.593865 1.114339 -0.406025
H  -2.683859 3.016527 0.485436
H  -3.34017 2.510862 2.034714
H  -0.166068 3.261288 0.796085
H  0.633513 2.285483 2.02979
H  -0.619467 3.428048 2.491037
H  -0.51087 -1.090189 1.553527
H  -1.983684 -1.749932 -0.95384
H  -5.509261 1.405814 0.537144
H  -4.257727 -2.471847 -2.725578
H  -3.908498 -3.447339 -1.310995
H  -5.530813 -2.804468 -1.560458
H  3.56126 2.145619 -0.933551
H  5.214408 -0.095042 -2.211278
H  5.708386 0.924448 -0.858463
H  5.448268 1.645366 -2.437974
H  4.761265 -2.746818 1.170444
H  3.3421 -3.308498 1.988557
H  -6.111454 -0.657619 -0.668155
elementType: F N C H
totalener: -995.53080798 hartree
nucrepener: 1775.41124655 hartree
electener: -2770.94205453 hartree
oneelecener: -4881.92757484 hartree
twoeener: 2110.98552030 hartree
cpcmener: -0.03172858 hartree
kineticenergy: 991.22361650 hartree
xcener: -96.219309621237 hartree
chargesum: -0.0000000
charge: -0.272105 -0.196288 -0.435252 -0.444787 -0.420654 -0.253083 0.046508 0.210273 -0.080240 -0.090902 -0.080028 -0.325191 -0.223825 -0.183456 -0.019360 -0.139139 0.400787 -0.220295 0.234836 0.345722 0.192893 -0.251878 0.058175 0.084971 0.080566 0.088667 0.080698 0.088565 0.099407 0.162096 0.129620 0.145367 0.102795 0.099012 0.092622 0.086533 0.087702 0.087880 0.101610 0.194136 0.193701 0.141342
qa: -0.2721 -0.1963 -0.4353 -0.4448 -0.4207 -0.2531 0.0465 0.2103 -0.0802 -0.0909 -0.0800 -0.3252 -0.2238 -0.1835 -0.0194 -0.1391 0.4008 -0.2203 0.2348 0.3457 0.1929 -0.2519 0.0582 0.0850 0.0806 0.0887 0.0807 0.0886 0.0994 0.1621 0.1296 0.1454 0.1028 0.0990 0.0926 0.0865 0.0877 0.0879 0.1016 0.1941 0.1937 0.1413
va: 0.9771 3.1988 2.9773 2.9776 2.9638 3.2144 3.8919 3.7251 3.9318 3.7509 3.7821 3.9595 3.9962 3.9399 3.7643 3.8715 4.1976 3.9081 4.0843 4.3418 3.9535 3.9330 1.0265 1.0453 1.0073 1.0105 1.0032 1.0054 1.0018 1.0306 1.0188 1.0011 0.9929 0.9976 1.0040 0.9970 1.0134 1.0155 1.0074 1.0084 1.0084 0.9992
dispcorr: -0.018181710 hartree
energy: -995.548989691375
dipole: -10.19461 10.32578 0.13117 3.08809 -3.78068 -0.69260 4.09872 -2.57882 1.51990
magnitude: 1.67541 au
magnitude: 4.25855 debye
