program: Orca
programVersion: 5.0.2
elementType: F N N N N N C C C C C C C C C C C C C C C C H H H H H H H H H H H H H H H H H H H H
charge: 0
multiplicity: 1
keywords: wb97x-d3
keywords: def2-TZVPP
keywords: def2/J RIJCOSX
keywords: DEFGRID2
keywords: scfconv7
keywords: smallprint printgap noloewdin
keywords: NOSOSCF
formula: C16H20FN5
InChI: InChI=1/C16H20FN5/c1-8-4-5-11-7-9(2)13(12(11)6-8)19-16-21-14(10(3)17)20-15(18)22-16/h4-6,9-10,13,19H,7,18H2,1-3H3
42 atoms
F  3.63606 -0.867813 2.686187
N  0.055903 1.109086 0.195213
N  2.046828 0.188387 0.804121
N  1.223363 -0.065542 -1.404014
N  3.318134 -0.994684 -0.791225
N  2.498979 -1.204138 -2.91402
C  -1.803814 2.656597 -0.351537
C  -1.145401 1.28089 -0.600357
C  -2.797845 2.410918 0.800646
C  -2.22344 0.314069 -0.167146
C  -3.150053 0.959215 0.645462
C  -2.529669 3.129143 -1.60413
C  -2.329745 -1.038427 -0.440624
C  -4.203395 0.242857 1.188513
C  -3.388465 -1.772598 0.097895
C  -4.313035 -1.116007 0.909869
C  1.123996 0.383072 -0.157321
C  -3.52989 -3.235338 -0.206566
C  3.097582 -0.501195 0.414582
C  2.339273 -0.739764 -1.674972
C  4.195279 -0.728028 1.419579
C  5.175929 0.422732 1.430676
H  -1.049281 3.396552 -0.079014
H  -0.868321 1.158167 -1.645949
H  -3.665673 3.070945 0.743741
H  -2.333114 2.588493 1.775413
H  -1.837205 3.267821 -2.435591
H  -3.029735 4.08189 -1.426609
H  -3.290206 2.412931 -1.922935
H  -0.005587 1.344565 1.175352
H  -1.601854 -1.531533 -1.075627
H  -4.938072 0.727036 1.820716
H  -3.756786 -3.401735 -1.261212
H  -2.609267 -3.779171 0.009431
H  -4.329601 -3.690034 0.376817
H  4.709516 -1.660729 1.180051
H  4.682587 1.361741 1.684466
H  5.63533 0.534943 0.44892
H  5.973319 0.239619 2.150789
H  3.323026 -1.72478 -3.159037
H  1.792857 -1.048842 -3.612439
H  -5.138406 -1.678762 1.330031
elementType: F N C H
totalener: -995.53053017 hartree
nucrepener: 1787.44683073 hartree
electener: -2782.97736090 hartree
oneelecener: -4905.95047209 hartree
twoeener: 2122.97311120 hartree
cpcmener: -0.03290053 hartree
kineticenergy: 991.22104645 hartree
xcener: -96.217837496422 hartree
chargesum: -0.0000000
charge: -0.266503 -0.201577 -0.444383 -0.449747 -0.435009 -0.256669 0.067010 0.260356 -0.097854 -0.117311 -0.125490 -0.331580 -0.187582 -0.186853 -0.031840 -0.146022 0.398999 -0.222321 0.263489 0.350446 0.179153 -0.272269 0.054547 0.097379 0.083941 0.094283 0.089531 0.090561 0.095879 0.164558 0.134464 0.147358 0.102879 0.100942 0.091239 0.079103 0.095574 0.097291 0.103029 0.192796 0.195863 0.142337
qa: -0.2665 -0.2016 -0.4444 -0.4497 -0.4350 -0.2567 0.0670 0.2604 -0.0979 -0.1173 -0.1255 -0.3316 -0.1876 -0.1869 -0.0318 -0.1460 0.3990 -0.2223 0.2635 0.3504 0.1792 -0.2723 0.0545 0.0974 0.0839 0.0943 0.0895 0.0906 0.0959 0.1646 0.1345 0.1474 0.1029 0.1009 0.0912 0.0791 0.0956 0.0973 0.1030 0.1928 0.1959 0.1423
va: 0.9911 3.2269 3.0083 2.9211 2.9841 3.2227 3.8703 3.6520 3.9331 3.6950 3.7946 3.9578 3.9375 3.9604 3.7881 3.8731 4.2025 3.9093 4.0253 4.3264 3.9978 3.9110 1.0231 1.0390 1.0075 1.0041 1.0039 1.0046 0.9961 1.0275 1.0173 0.9982 0.9935 0.9957 1.0050 1.0088 1.0130 1.0140 1.0064 1.0095 1.0065 0.9988
dispcorr: -0.018331077 hartree
energy: -995.548861242128
dipole: -14.81821 14.34807 -0.47014 5.65906 -5.29378 0.36527 -6.78348 5.16119 -1.62229
magnitude: 1.72808 au
magnitude: 4.39244 debye
