program: Orca
programVersion: 5.0.2
elementType: F N N N N N C C C C C C C C C C C C C C C C H H H H H H H H H H H H H H H H H H H H
charge: 0
multiplicity: 1
keywords: wb97x-d3
keywords: def2-TZVPP
keywords: def2/J RIJCOSX
keywords: DEFGRID2
keywords: scfconv7
keywords: smallprint printgap noloewdin
keywords: NOSOSCF
formula: C16H20FN5
InChI: InChI=1/C16H20FN5/c1-8-4-5-11-7-9(2)13(12(11)6-8)19-16-21-14(10(3)17)20-15(18)22-16/h4-6,9-10,13,19H,7,18H2,1-3H3
42 atoms
F  3.305101 2.228894 -1.245208
N  -0.121667 -0.470796 0.788688
N  1.827104 0.284509 -0.163634
N  1.798634 -1.60773 1.260718
N  3.823241 -0.895026 0.255468
N  3.766641 -2.692181 1.666551
C  -1.116966 1.828572 1.092607
C  -0.921954 0.578938 0.192527
C  -2.477483 1.614487 1.786741
C  -2.329288 0.094283 -0.035758
C  -3.209886 0.69693 0.850266
C  -1.119079 3.094355 0.245982
C  -2.768559 -0.829515 -0.971714
C  -4.563106 0.395515 0.780686
C  -4.122475 -1.147149 -1.048116
C  -5.006193 -0.516349 -0.167898
C  1.200268 -0.598782 0.628285
C  -4.625228 -2.155255 -2.03982
C  3.11785 0.065576 -0.307927
C  3.106119 -1.711244 1.049212
C  3.869438 0.958808 -1.260955
C  3.81659 0.40346 -2.666782
H  -0.306852 1.895044 1.821072
H  -0.439325 0.858255 -0.74486
H  -3.003627 2.555542 1.962517
H  -2.358595 1.138197 2.764874
H  -1.911967 3.075716 -0.505807
H  -0.168943 3.218639 -0.277074
H  -1.274312 3.980241 0.86373
H  -0.566669 -1.117427 1.422554
H  -2.064981 -1.295801 -1.653382
H  -5.272754 0.864478 1.452287
H  -3.899085 -2.335868 -2.832085
H  -4.826626 -3.11533 -1.559081
H  -5.556112 -1.832349 -2.507377
H  4.904692 1.050127 -0.925356
H  2.787232 0.311117 -3.015275
H  4.276457 -0.584132 -2.698083
H  4.36379 1.046935 -3.356365
H  4.758348 -2.795063 1.538809
H  3.285588 -3.321332 2.285719
H  -6.064265 -0.745534 -0.228158
elementType: F N C H
totalener: -995.54253098 hartree
nucrepener: 1784.50969314 hartree
electener: -2780.05222412 hartree
oneelecener: -4900.10711149 hartree
twoeener: 2120.05488737 hartree
cpcmener: -0.02753507 hartree
kineticenergy: 991.21497323 hartree
xcener: -96.216283247159 hartree
chargesum: 0.0000000
charge: -0.262237 -0.184721 -0.434576 -0.441709 -0.427477 -0.252961 0.069970 0.196833 -0.081829 -0.087580 -0.082898 -0.330876 -0.230979 -0.191968 -0.012314 -0.138653 0.393410 -0.223585 0.231347 0.353722 0.191513 -0.276311 0.055746 0.096744 0.083231 0.090344 0.095556 0.086638 0.090457 0.158473 0.132164 0.143809 0.092824 0.102898 0.098429 0.080405 0.097595 0.096519 0.102117 0.190402 0.190513 0.139017
qa: -0.2622 -0.1847 -0.4346 -0.4417 -0.4275 -0.2530 0.0700 0.1968 -0.0818 -0.0876 -0.0829 -0.3309 -0.2310 -0.1920 -0.0123 -0.1387 0.3934 -0.2236 0.2313 0.3537 0.1915 -0.2763 0.0557 0.0967 0.0832 0.0903 0.0956 0.0866 0.0905 0.1585 0.1322 0.1438 0.0928 0.1029 0.0984 0.0804 0.0976 0.0965 0.1021 0.1904 0.1905 0.1390
va: 0.9977 3.2256 2.9704 2.9833 2.9818 3.2077 3.8456 3.6694 3.9421 3.6351 3.8014 3.9569 4.0025 3.9653 3.7538 3.8880 4.2081 3.9063 4.0712 4.3362 3.9744 3.9122 1.0208 1.0308 1.0068 1.0054 0.9961 1.0121 1.0047 1.0310 1.0113 1.0004 1.0037 0.9928 0.9984 1.0089 1.0111 1.0145 1.0065 1.0112 1.0107 0.9984
dispcorr: -0.018385110 hartree
energy: -995.560916092700
dipole: -15.44053 15.19215 -0.24838 0.39390 -1.84902 -1.45512 -4.68994 5.25466 0.56472
magnitude: 1.58050 au
magnitude: 4.01731 debye
