program: Orca
programVersion: 5.0.2
elementType: F N N N N N C C C C C C C C C C C C C C C C H H H H H H H H H H H H H H H H H H H H
charge: 0
multiplicity: 1
keywords: wb97x-d3
keywords: def2-TZVPP
keywords: def2/J RIJCOSX
keywords: DEFGRID2
keywords: scfconv7
keywords: smallprint printgap noloewdin
keywords: NOSOSCF
formula: C16H20FN5
InChI: InChI=1/C16H20FN5/c1-8-4-5-11-7-9(2)13(12(11)6-8)19-16-21-14(10(3)17)20-15(18)22-16/h4-6,9-10,13,19H,7,18H2,1-3H3
42 atoms
F  3.306213 -0.465087 -2.996093
N  -0.028468 0.086245 1.474702
N  1.46146 0.310442 -0.267071
N  1.81988 -1.242836 1.48418
N  3.382223 -1.054508 -0.28694
N  3.687946 -2.552549 1.412625
C  -1.698962 1.821942 2.031369
C  -1.000879 0.999543 0.929264
C  -3.080858 2.149483 1.443486
C  -2.156452 0.339331 0.213736
C  -3.34296 0.997008 0.51672
C  -0.905584 3.02633 2.497338
C  -2.137614 -0.745302 -0.644671
C  -4.532785 0.555559 -0.037652
C  -3.329831 -1.204139 -1.207357
C  -4.516445 -0.540979 -0.893242
C  1.112987 -0.288369 0.883594
C  -3.333294 -2.407918 -2.103919
C  2.597097 -0.119942 -0.782127
C  2.941015 -1.594799 0.86181
C  3.04629 0.538573 -2.062581
C  4.288589 1.371677 -1.864707
H  -1.857127 1.148507 2.882802
H  -0.477777 1.668391 0.240709
H  -3.044552 3.08986 0.881768
H  -3.844226 2.270715 2.214025
H  -0.742381 3.731502 1.67953
H  0.071922 2.73559 2.886507
H  -1.426725 3.558923 3.294638
H  -0.299854 -0.448405 2.287345
H  -1.206047 -1.248321 -0.88153
H  -5.470263 1.049433 0.190339
H  -2.450218 -2.436266 -2.742992
H  -3.336019 -3.332891 -1.522581
H  -4.212423 -2.428791 -2.747844
H  2.229767 1.149491 -2.451759
H  5.114804 0.768609 -1.487406
H  4.094632 2.168948 -1.146339
H  4.592497 1.838992 -2.801887
H  4.526104 -2.867499 0.955591
H  3.388631 -3.011671 2.255491
H  -5.447979 -0.891492 -1.322849
elementType: F N C H
totalener: -995.54386923 hartree
nucrepener: 1788.46700467 hartree
electener: -2784.01087390 hartree
oneelecener: -4907.75894790 hartree
twoeener: 2123.74807400 hartree
cpcmener: -0.02849067 hartree
kineticenergy: 991.21949674 hartree
xcener: -96.216885073160 hartree
chargesum: 0.0000000
charge: -0.266018 -0.192218 -0.425823 -0.438699 -0.420011 -0.253117 0.038012 0.254724 -0.088461 -0.094324 -0.133503 -0.314166 -0.210685 -0.158873 -0.020613 -0.141356 0.402529 -0.227105 0.239482 0.354147 0.172741 -0.269457 0.061678 0.083790 0.080298 0.087560 0.078869 0.089677 0.096835 0.154097 0.136533 0.142564 0.096946 0.102570 0.092433 0.078351 0.091909 0.098652 0.100715 0.191982 0.190360 0.136975
qa: -0.2660 -0.1922 -0.4258 -0.4387 -0.4200 -0.2531 0.0380 0.2547 -0.0885 -0.0943 -0.1335 -0.3142 -0.2107 -0.1589 -0.0206 -0.1414 0.4025 -0.2271 0.2395 0.3541 0.1727 -0.2695 0.0617 0.0838 0.0803 0.0876 0.0789 0.0897 0.0968 0.1541 0.1365 0.1426 0.0969 0.1026 0.0924 0.0784 0.0919 0.0987 0.1007 0.1920 0.1904 0.1370
va: 0.9927 3.2102 2.9808 2.9795 3.0041 3.2087 3.9081 3.7002 3.9269 3.8097 3.8357 3.9516 3.9713 3.9369 3.7926 3.8857 4.1804 3.9116 4.0314 4.3322 3.9747 3.9224 1.0235 1.0390 1.0069 1.0099 1.0046 1.0067 1.0008 1.0349 1.0161 1.0005 0.9992 0.9923 1.0030 1.0122 1.0188 1.0083 1.0073 1.0101 1.0109 0.9997
dispcorr: -0.018302953 hartree
energy: -995.562172179871
dipole: -12.48004 12.00230 -0.47774 8.61895 -8.43796 0.18098 5.49702 -3.92176 1.57526
magnitude: 1.65603 au
magnitude: 4.20929 debye
