program: Orca
programVersion: 5.0.2
elementType: F N N N N N C C C C C C C C C C C C C C C C H H H H H H H H H H H H H H H H H H H H
charge: 0
multiplicity: 1
keywords: wb97x-d3
keywords: def2-TZVPP
keywords: def2/J RIJCOSX
keywords: DEFGRID2
keywords: scfconv7
keywords: smallprint printgap noloewdin
keywords: NOSOSCF
formula: C16H20FN5
InChI: InChI=1/C16H20FN5/c1-8-4-5-11-7-9(2)13(12(11)6-8)19-16-21-14(10(3)17)20-15(18)22-16/h4-6,9-10,13,19H,7,18H2,1-3H3
42 atoms
F  3.33166 -0.409155 -2.992657
N  -0.038113 0.0817 1.440952
N  1.481011 0.333328 -0.27571
N  1.809722 -1.243468 1.460425
N  3.40308 -1.0305 -0.278692
N  3.676566 -2.5548 1.403741
C  -1.695146 1.826453 2.009432
C  -1.014648 0.994527 0.902328
C  -3.093377 2.137467 1.45213
C  -2.181473 0.328414 0.210448
C  -3.365138 0.981368 0.533237
C  -0.90207 3.043541 2.442383
C  -2.173544 -0.757862 -0.64637
C  -4.562849 0.534734 0.000354
C  -3.373504 -1.221101 -1.188484
C  -4.557109 -0.562317 -0.85443
C  1.11245 -0.281032 0.86032
C  -3.389371 -2.424265 -2.086008
C  2.627193 -0.088904 -0.775092
C  2.940447 -1.588431 0.852726
C  3.101895 0.583355 -2.039412
C  4.371062 1.371041 -1.823557
H  -1.827667 1.162439 2.872459
H  -0.499427 1.655397 0.200358
H  -3.082361 3.077916 0.889759
H  -3.83991 2.250082 2.240392
H  -0.763476 3.738965 1.611882
H  0.086034 2.766963 2.814534
H  -1.411416 3.582049 3.243371
H  -0.310215 -0.461808 2.247422
H  -1.243801 -1.257119 -0.898081
H  -5.497741 1.025647 0.244647
H  -3.395855 -3.349941 -1.505845
H  -4.271914 -2.438288 -2.725527
H  -2.509885 -2.457634 -2.72967
H  2.306632 1.227963 -2.41771
H  5.180183 0.729263 -1.474142
H  4.209111 2.148645 -1.076421
H  4.683181 1.859769 -2.74689
H  4.513568 -2.875078 0.948341
H  3.351203 -3.034665 2.225147
H  -5.494221 -0.916735 -1.2684
elementType: F N C H
totalener: -995.54382692 hartree
nucrepener: 1786.00381977 hartree
electener: -2781.54764670 hartree
oneelecener: -4902.82040210 hartree
twoeener: 2121.27275541 hartree
cpcmener: -0.02838704 hartree
kineticenergy: 991.21834562 hartree
xcener: -96.216419712010 hartree
chargesum: -0.0000000
charge: -0.266074 -0.190411 -0.423854 -0.439256 -0.420080 -0.253833 0.031921 0.248968 -0.083353 -0.093480 -0.128995 -0.314086 -0.210042 -0.163155 -0.020768 -0.139890 0.403445 -0.226719 0.238905 0.354041 0.173305 -0.269272 0.061671 0.084569 0.080155 0.087516 0.078977 0.089808 0.097031 0.153882 0.137010 0.142510 0.102546 0.092561 0.096764 0.077611 0.091207 0.098735 0.101008 0.191912 0.190355 0.136853
qa: -0.2661 -0.1904 -0.4239 -0.4393 -0.4201 -0.2538 0.0319 0.2490 -0.0834 -0.0935 -0.1290 -0.3141 -0.2100 -0.1632 -0.0208 -0.1399 0.4034 -0.2267 0.2389 0.3540 0.1733 -0.2693 0.0617 0.0846 0.0802 0.0875 0.0790 0.0898 0.0970 0.1539 0.1370 0.1425 0.1025 0.0926 0.0968 0.0776 0.0912 0.0987 0.1010 0.1919 0.1904 0.1369
va: 0.9924 3.2104 2.9867 2.9776 3.0031 3.2083 3.9154 3.7067 3.9205 3.8078 3.8321 3.9525 3.9722 3.9397 3.7896 3.8852 4.1798 3.9111 4.0340 4.3321 3.9711 3.9220 1.0239 1.0391 1.0071 1.0098 1.0044 1.0065 1.0007 1.0353 1.0152 1.0006 0.9924 1.0028 0.9994 1.0125 1.0196 1.0079 1.0070 1.0101 1.0109 0.9996
dispcorr: -0.018243384 hartree
energy: -995.562070305651
dipole: -12.48300 11.98610 -0.49689 8.41645 -8.27764 0.13881 5.52413 -3.95871 1.56542
magnitude: 1.64824 au
magnitude: 4.18950 debye
